program: Orca
programVersion: 5.0.2
elementType: F N N N N N C C C C C C C C C C C C C C C C H H H H H H H H H H H H H H H H H H H H
charge: 0
multiplicity: 1
keywords: wb97x-d3
keywords: def2-TZVPP
keywords: def2/J RIJCOSX
keywords: DEFGRID2
keywords: scfconv7
keywords: smallprint printgap noloewdin
keywords: NOSOSCF
formula: C16H20FN5
InChI: InChI=1/C16H20FN5/c1-8-4-5-11-7-9(2)13(12(11)6-8)19-16-21-14(10(3)17)20-15(18)22-16/h4-6,9-10,13,19H,7,18H2,1-3H3
42 atoms
F  2.738833 -2.563398 1.931643
N  0.343183 1.829857 -1.031546
N  0.993496 0.054417 0.281878
N  2.428318 0.971575 -1.357818
N  3.11864 -0.898684 -0.070767
N  4.492848 0.038375 -1.637324
C  -1.016577 2.41811 1.025019
C  -0.971833 1.962611 -0.451188
C  -2.375747 1.903634 1.528917
C  -1.830311 0.721391 -0.460513
C  -2.627257 0.690752 0.67804
C  -0.795045 3.906363 1.210957
C  -1.905783 -0.275107 -1.414196
C  -3.496371 -0.367897 0.876765
C  -2.778198 -1.349564 -1.22761
C  -3.560142 -1.382923 -0.073963
C  1.275594 0.929177 -0.689076
C  -2.86283 -2.442498 -2.252837
C  1.950713 -0.824176 0.526054
C  3.315182 0.046084 -1.011036
C  1.608219 -1.834315 1.592477
C  0.517605 -2.780971 1.1389
H  -0.237925 1.869427 1.56028
H  -1.469176 2.726255 -1.05988
H  -3.157261 2.65411 1.360436
H  -2.371399 1.689457 2.599311
H  -1.559283 4.490843 0.692665
H  0.178742 4.217136 0.826921
H  -0.827787 4.182886 2.266398
H  0.605984 2.480546 -1.753876
H  -1.281661 -0.237262 -2.301255
H  -4.116048 -0.420489 1.76446
H  -3.267619 -2.072559 -3.19727
H  -1.879661 -2.862623 -2.472545
H  -3.503501 -3.25825 -1.918903
H  1.282539 -1.292616 2.485241
H  -0.399928 -2.22972 0.93801
H  0.301678 -3.513663 1.916775
H  0.801836 -3.311777 0.228986
H  5.189885 -0.645415 -1.397998
H  4.700228 0.721396 -2.345446
H  -4.230713 -2.21915 0.087038
elementType: F N C H
totalener: -995.54107219 hartree
nucrepener: 1858.16118590 hartree
electener: -2853.70225810 hartree
oneelecener: -5047.56936365 hartree
twoeener: 2193.86710555 hartree
cpcmener: -0.02948547 hartree
kineticenergy: 991.21041322 hartree
xcener: -96.221102328783 hartree
chargesum: 0.0000000
charge: -0.260051 -0.222221 -0.451725 -0.433291 -0.399849 -0.250113 -0.052444 0.320433 -0.067308 -0.067301 -0.105189 -0.314329 -0.261246 -0.177864 -0.020760 -0.134466 0.401803 -0.223867 0.230148 0.352279 0.187173 -0.249935 0.081780 0.097107 0.079473 0.086931 0.076383 0.089279 0.096120 0.164092 0.123300 0.140796 0.102857 0.100018 0.089446 0.080634 0.069738 0.103884 0.099820 0.191654 0.189788 0.137021
qa: -0.2601 -0.2222 -0.4517 -0.4333 -0.3998 -0.2501 -0.0524 0.3204 -0.0673 -0.0673 -0.1052 -0.3143 -0.2612 -0.1779 -0.0208 -0.1345 0.4018 -0.2239 0.2301 0.3523 0.1872 -0.2499 0.0818 0.0971 0.0795 0.0869 0.0764 0.0893 0.0961 0.1641 0.1233 0.1408 0.1029 0.1000 0.0894 0.0806 0.0697 0.1039 0.0998 0.1917 0.1898 0.1370
va: 1.0021 3.2154 2.9095 3.0024 3.0118 3.2022 3.8991 3.6477 3.9034 3.6313 3.7936 3.9599 3.9794 3.9520 3.7450 3.8612 4.1778 3.9120 4.0140 4.3360 4.0229 3.8978 1.0346 1.0012 1.0080 1.0107 1.0046 1.0054 1.0009 1.0251 1.0175 1.0014 0.9939 0.9952 1.0058 1.0033 1.0199 1.0091 1.0086 1.0102 1.0108 1.0003
dispcorr: -0.021029561 hartree
energy: -995.562101754401
dipole: -17.32006 16.82334 -0.49671 5.28328 -4.03782 1.24546 -1.28225 0.30506 -0.97719
magnitude: 1.65915 au
magnitude: 4.21723 debye
