program: Orca
programVersion: 5.0.2
elementType: F N N N N N C C C C C C C C C C C C C C C C H H H H H H H H H H H H H H H H H H H H
charge: 0
multiplicity: 1
keywords: wb97x-d3
keywords: def2-TZVPP
keywords: def2/J RIJCOSX
keywords: DEFGRID2
keywords: scfconv7
keywords: smallprint printgap noloewdin
keywords: NOSOSCF
formula: C16H20FN5
InChI: InChI=1/C16H20FN5/c1-8-4-5-11-7-9(2)13(12(11)6-8)19-16-21-14(10(3)17)20-15(18)22-16/h4-6,9-10,13,19H,7,18H2,1-3H3
42 atoms
F  3.420894 -0.299991 -2.969483
N  -0.061976 0.030092 1.390354
N  1.498178 0.341851 -0.27754
N  1.799284 -1.277044 1.424287
N  3.433209 -1.003199 -0.268704
N  3.680233 -2.56847 1.379523
C  -1.676159 1.821874 1.954344
C  -1.027964 0.955083 0.854943
C  -3.067088 2.164298 1.397029
C  -2.21763 0.301385 0.192228
C  -3.380726 0.992684 0.510827
C  -0.843442 3.019638 2.365055
C  -2.246417 -0.808626 -0.632393
C  -4.595195 0.560467 0.005115
C  -3.46411 -1.258497 -1.146005
C  -4.626889 -0.561518 -0.816843
C  1.107237 -0.306618 0.831865
C  -3.518197 -2.487392 -2.006499
C  2.660227 -0.055853 -0.758885
C  2.94855 -1.594715 0.836359
C  3.158926 0.659042 -1.989918
C  4.413163 1.451737 -1.717606
H  -1.823412 1.173899 2.827059
H  -0.510067 1.59349 0.134659
H  -3.02666 3.087829 0.808399
H  -3.805212 2.323698 2.185046
H  -0.687517 3.698386 1.523924
H  0.137684 2.716979 2.735537
H  -1.33021 3.585366 3.161177
H  -0.34802 -0.529374 2.180845
H  -1.33222 -1.33886 -0.8780
H  -5.515195 1.080531 0.245692
H  -4.42133 -2.514004 -2.616163
H  -2.660613 -2.545969 -2.677579
H  -3.510547 -3.395581 -1.399319
H  2.366236 1.307243 -2.366784
H  4.220996 2.207997 -0.955788
H  4.746209 1.967803 -2.618498
H  5.218691 0.809145 -1.361412
H  4.536985 -2.862582 0.943588
H  3.347864 -3.067142 2.186726
H  -5.577811 -0.904854 -1.208074
elementType: F N C H
totalener: -995.54393616 hartree
nucrepener: 1783.59837144 hartree
electener: -2779.14230760 hartree
oneelecener: -4897.98831075 hartree
twoeener: 2118.84600315 hartree
cpcmener: -0.02834819 hartree
kineticenergy: 991.22120970 hartree
xcener: -96.217180205033 hartree
chargesum: 0.0000000
charge: -0.266527 -0.190114 -0.422545 -0.439478 -0.420448 -0.253363 0.033208 0.236465 -0.084307 -0.087028 -0.126146 -0.314259 -0.209453 -0.165664 -0.021828 -0.138280 0.403134 -0.226017 0.239177 0.354311 0.173450 -0.269397 0.061212 0.086048 0.080025 0.087804 0.078836 0.089492 0.097545 0.154682 0.137628 0.142456 0.092325 0.097222 0.102610 0.077049 0.098861 0.100785 0.091196 0.191822 0.190457 0.137054
qa: -0.2665 -0.1901 -0.4225 -0.4395 -0.4204 -0.2534 0.0332 0.2365 -0.0843 -0.0870 -0.1261 -0.3143 -0.2095 -0.1657 -0.0218 -0.1383 0.4031 -0.2260 0.2392 0.3543 0.1735 -0.2694 0.0612 0.0860 0.0800 0.0878 0.0788 0.0895 0.0975 0.1547 0.1376 0.1425 0.0923 0.0972 0.1026 0.0770 0.0989 0.1008 0.0912 0.1918 0.1905 0.1371
va: 0.9919 3.2120 2.9893 2.9778 3.0026 3.2085 3.9130 3.7140 3.9202 3.7972 3.8293 3.9532 3.9739 3.9412 3.7861 3.8821 4.1809 3.9109 4.0355 4.3321 3.9704 3.9216 1.0240 1.0408 1.0073 1.0097 1.0045 1.0064 1.0007 1.0347 1.0135 1.0008 1.0030 0.9989 0.9923 1.0129 1.0079 1.0071 1.0196 1.0101 1.0107 0.9997
dispcorr: -0.018203144 hartree
energy: -995.562139300942
dipole: -12.66008 12.14543 -0.51465 8.22645 -8.12109 0.10536 5.67677 -4.10049 1.57629
magnitude: 1.66152 au
magnitude: 4.22324 debye
