program: Orca
programVersion: 5.0.2
elementType: F N N N N N C C C C C C C C C C C C C C C C H H H H H H H H H H H H H H H H H H H H
charge: 0
multiplicity: 1
keywords: wb97x-d3
keywords: def2-TZVPP
keywords: def2/J RIJCOSX
keywords: DEFGRID2
keywords: scfconv7
keywords: smallprint printgap noloewdin
keywords: NOSOSCF
formula: C16H20FN5
InChI: InChI=1/C16H20FN5/c1-8-4-5-11-7-9(2)13(12(11)6-8)19-16-21-14(10(3)17)20-15(18)22-16/h4-6,9-10,13,19H,7,18H2,1-3H3
42 atoms
F  3.4854 -0.224052 -2.947682
N  -0.075821 -0.006296 1.347109
N  1.519484 0.354578 -0.278447
N  1.795895 -1.296564 1.396208
N  3.461554 -0.980301 -0.257702
N  3.685611 -2.575698 1.364823
C  -1.658735 1.815535 1.914177
C  -1.038557 0.924733 0.817497
C  -3.05184 2.171236 1.370611
C  -2.246807 0.277545 0.182513
C  -3.394821 0.991914 0.505464
C  -0.803078 3.006153 2.29751
C  -2.304357 -0.845137 -0.62314
C  -4.622244 0.571912 0.021332
C  -3.53531 -1.28195 -1.116085
C  -4.682339 -0.560864 -0.784072
C  1.108861 -0.319871 0.808109
C  -3.619193 -2.521114 -1.959122
C  2.693243 -0.027038 -0.744028
C  2.958729 -1.596019 0.825755
C  3.211378 0.714321 -1.951283
C  4.463843 1.496829 -1.644503
H  -1.803606 1.180845 2.79705
H  -0.524542 1.546564 0.080197
H  -3.005427 3.08544 0.768004
H  -3.777143 2.352889 2.165576
H  -0.648444 3.670734 1.444916
H  0.178358 2.693881 2.659242
H  -1.270917 3.589648 3.092219
H  -0.367269 -0.577588 2.12728
H  -1.402388 -1.39485 -0.870848
H  -5.530623 1.110637 0.264873
H  -3.604447 -3.421755 -1.340967
H  -4.536341 -2.547564 -2.547337
H  -2.777796 -2.594829 -2.648932
H  2.4255 1.372767 -2.325381
H  4.808332 2.034379 -2.528376
H  5.263705 0.843747 -1.295324
H  4.264015 2.234361 -0.866427
H  4.551805 -2.857289 0.939338
H  3.339785 -3.09214 2.155041
H  -5.643341 -0.89343 -1.159563
elementType: F N C H
totalener: -995.54398558 hartree
nucrepener: 1781.25087237 hartree
electener: -2776.79485794 hartree
oneelecener: -4893.28000800 hartree
twoeener: 2116.48515006 hartree
cpcmener: -0.02827485 hartree
kineticenergy: 991.22028802 hartree
xcener: -96.217062722269 hartree
chargesum: 0.0000000
charge: -0.266659 -0.189776 -0.421686 -0.439930 -0.420523 -0.253470 0.031546 0.229159 -0.083438 -0.085899 -0.120040 -0.314110 -0.208765 -0.169518 -0.022590 -0.136495 0.403803 -0.225112 0.239086 0.354282 0.173466 -0.269343 0.060817 0.086962 0.080015 0.088024 0.078831 0.089327 0.097987 0.155282 0.137430 0.142248 0.102630 0.092074 0.097364 0.076884 0.100766 0.091031 0.098873 0.191785 0.190543 0.137136
qa: -0.2667 -0.1898 -0.4217 -0.4399 -0.4205 -0.2535 0.0315 0.2292 -0.0834 -0.0859 -0.1200 -0.3141 -0.2088 -0.1695 -0.0226 -0.1365 0.4038 -0.2251 0.2391 0.3543 0.1735 -0.2693 0.0608 0.0870 0.0800 0.0880 0.0788 0.0893 0.0980 0.1553 0.1374 0.1422 0.1026 0.0921 0.0974 0.0769 0.1008 0.0910 0.0989 0.1918 0.1905 0.1371
va: 0.9915 3.2126 2.9923 2.9772 3.0019 3.2082 3.9139 3.7183 3.9176 3.7935 3.8241 3.9541 3.9764 3.9438 3.7833 3.8796 4.1811 3.9105 4.0372 4.3322 3.9690 3.9213 1.0242 1.0418 1.0074 1.0097 1.0044 1.0063 1.0005 1.0344 1.0127 1.0010 0.9923 1.0032 0.9987 1.0129 1.0071 1.0198 1.0079 1.0101 1.0107 0.9997
dispcorr: -0.018161350 hartree
energy: -995.562146928235
dipole: -12.79616 12.26078 -0.53538 8.06749 -7.99393 0.07356 5.71768 -4.14979 1.56789
magnitude: 1.65841 au
magnitude: 4.21535 debye
