program: Orca
programVersion: 5.0.2
elementType: F N N N N N C C C C C C C C C C C C C C C C H H H H H H H H H H H H H H H H H H H H
charge: 0
multiplicity: 1
keywords: wb97x-d3
keywords: def2-TZVPP
keywords: def2/J RIJCOSX
keywords: DEFGRID2
keywords: scfconv7
keywords: smallprint printgap noloewdin
keywords: NOSOSCF
formula: C16H20FN5
InChI: InChI=1/C16H20FN5/c1-8-4-5-11-7-9(2)13(12(11)6-8)19-16-21-14(10(3)17)20-15(18)22-16/h4-6,9-10,13,19H,7,18H2,1-3H3
42 atoms
F  3.944521 -0.065957 -2.770193
N  -0.095896 -0.14961 1.240758
N  1.561997 0.292865 -0.29615
N  1.788225 -1.426253 1.313611
N  3.518456 -1.019656 -0.25545
N  3.696696 -2.67766 1.307897
C  -1.554816 1.799534 1.77726
C  -1.02946 0.811483 0.715048
C  -2.929849 2.226721 1.239071
C  -2.296721 0.208404 0.15867
C  -3.380828 1.024509 0.458175
C  -0.606421 2.943681 2.074288
C  -2.455636 -0.955362 -0.572436
C  -4.646737 0.669055 0.022645
C  -3.725562 -1.327233 -1.01553
C  -4.808798 -0.503201 -0.707926
C  1.113986 -0.431918 0.739937
C  -3.923734 -2.603448 -1.779895
C  2.756967 -0.057338 -0.731141
C  2.979002 -1.684745 0.781373
C  3.309641 0.773178 -1.86009
C  4.290776 1.802758 -1.350661
H  -1.723872 1.225055 2.696217
H  -0.514367 1.36388 -0.074914
H  -2.82689 3.093683 0.576319
H  -3.621084 2.515965 2.032471
H  0.354836 2.582456 2.443963
H  -1.015002 3.609751 2.836166
H  -0.416627 3.540316 1.179491
H  -0.410206 -0.740216 1.997094
H  -1.603045 -1.585428 -0.802368
H  -5.506981 1.28859 0.247962
H  -4.766002 -2.53494 -2.468592
H  -3.038469 -2.865839 -2.359557
H  -4.125727 -3.440581 -1.107409
H  2.481314 1.259118 -2.379202
H  4.685766 2.399796 -2.173151
H  5.123141 1.332593 -0.825982
H  3.792675 2.481707 -0.657937
H  4.608768 -2.893345 0.944334
H  3.349903 -3.19736 2.095503
H  -5.800176 -0.784305 -1.04473
elementType: F N C H
totalener: -995.54459037 hartree
nucrepener: 1778.54443974 hartree
electener: -2774.08903011 hartree
oneelecener: -4887.81252973 hartree
twoeener: 2113.72349962 hartree
cpcmener: -0.02834537 hartree
kineticenergy: 991.22528690 hartree
xcener: -96.219447307198 hartree
chargesum: -0.0000000
charge: -0.264015 -0.193258 -0.428817 -0.441460 -0.416580 -0.251710 0.035969 0.215109 -0.084397 -0.086242 -0.106647 -0.314592 -0.209781 -0.174717 -0.015291 -0.139371 0.401272 -0.224649 0.239070 0.355294 0.178504 -0.274818 0.058870 0.087471 0.080129 0.087903 0.089314 0.098456 0.078701 0.157601 0.135837 0.141802 0.094922 0.095153 0.102845 0.077974 0.102039 0.094588 0.098144 0.191782 0.190470 0.137128
qa: -0.2640 -0.1933 -0.4288 -0.4415 -0.4166 -0.2517 0.0360 0.2151 -0.0844 -0.0862 -0.1066 -0.3146 -0.2098 -0.1747 -0.0153 -0.1394 0.4013 -0.2246 0.2391 0.3553 0.1785 -0.2748 0.0589 0.0875 0.0801 0.0879 0.0893 0.0985 0.0787 0.1576 0.1358 0.1418 0.0949 0.0952 0.1028 0.0780 0.1020 0.0946 0.0981 0.1918 0.1905 0.1371
va: 0.9954 3.2137 2.9761 2.9780 3.0041 3.2071 3.9097 3.7180 3.9204 3.7863 3.8146 3.9573 3.9847 3.9466 3.7669 3.8844 4.1919 3.9084 4.0382 4.3336 3.9844 3.9163 1.0245 1.0465 1.0075 1.0098 1.0060 1.0004 1.0044 1.0329 1.0123 1.0015 1.0013 1.0010 0.9923 1.0105 1.0069 1.0151 1.0113 1.0101 1.0107 0.9996
dispcorr: -0.018201045 hartree
energy: -995.562791414644
dipole: -14.33182 13.60044 -0.73138 8.49876 -8.41739 0.08137 5.76421 -4.26140 1.50281
magnitude: 1.67331 au
magnitude: 4.25323 debye
