program: Orca
programVersion: 5.0.2
elementType: F N N N N N C C C C C C C C C C C C C C C C H H H H H H H H H H H H H H H H H H H H
charge: 0
multiplicity: 1
keywords: wb97x-d3
keywords: def2-TZVPP
keywords: def2/J RIJCOSX
keywords: DEFGRID2
keywords: scfconv7
keywords: smallprint printgap noloewdin
keywords: NOSOSCF
formula: C16H20FN5
InChI: InChI=1/C16H20FN5/c1-8-4-5-11-7-9(2)13(12(11)6-8)19-16-21-14(10(3)17)20-15(18)22-16/h4-6,9-10,13,19H,7,18H2,1-3H3
42 atoms
F  5.527229 -1.196031 -0.04543
N  -0.108543 -0.176859 0.509932
N  2.029765 -0.899163 0.19306
N  1.424107 1.334072 -0.302235
N  3.650819 0.593453 -0.643227
N  3.028659 2.741487 -1.10907
C  -1.577291 1.282326 1.935069
C  -1.217643 0.739909 0.5333
C  -3.074408 1.614676 1.827884
C  -2.511389 0.114844 0.075157
C  -3.572164 0.624996 0.814103
C  -0.709754 2.433904 2.403503
C  -2.717873 -0.812982 -0.930989
C  -4.862919 0.204111 0.540623
C  -4.01298 -1.251369 -1.211878
C  -5.072205 -0.730007 -0.468006
C  1.140389 0.106458 0.118641
C  -4.258844 -2.287204 -2.269923
C  3.247277 -0.579464 -0.200584
C  2.687127 1.528735 -0.673588
C  4.244346 -1.709364 -0.185637
C  4.163157 -2.518602 -1.461397
H  -1.47264 0.445173 2.635254
H  -0.965391 1.576029 -0.12529
H  -3.213402 2.638446 1.461522
H  -3.589131 1.550084 2.788182
H  -0.769128 3.278819 1.71402
H  0.338817 2.144586 2.485495
H  -1.024013 2.787141 3.387255
H  -0.258241 -1.107275 0.871468
H  -1.880781 -1.204255 -1.499967
H  -5.704435 0.58834 1.105222
H  -5.233096 -2.157913 -2.741799
H  -3.500744 -2.250355 -3.052417
H  -4.237594 -3.295148 -1.848725
H  4.043546 -2.345529 0.679517
H  4.885471 -3.335225 -1.445379
H  4.356848 -1.897527 -2.337116
H  3.170137 -2.954705 -1.566396
H  3.977417 2.935273 -1.379068
H  2.350578 3.483206 -1.137579
H  -6.081713 -1.064147 -0.67909
elementType: F N C H
totalener: -995.54515017 hartree
nucrepener: 1766.17121528 hartree
electener: -2761.71636545 hartree
oneelecener: -4862.93962463 hartree
twoeener: 2101.22325918 hartree
cpcmener: -0.02821183 hartree
kineticenergy: 991.21418651 hartree
xcener: -96.218614508789 hartree
chargesum: 0.0000000
charge: -0.261305 -0.197685 -0.454543 -0.440982 -0.415076 -0.255273 0.048099 0.195378 -0.086096 -0.091974 -0.071877 -0.320648 -0.221914 -0.179415 -0.012496 -0.137838 0.412669 -0.222005 0.261245 0.345220 0.179264 -0.273433 0.055580 0.085959 0.080116 0.087367 0.079156 0.089219 0.098420 0.162633 0.131285 0.142377 0.094969 0.094957 0.102720 0.079133 0.101745 0.097796 0.095547 0.190992 0.192536 0.138174
qa: -0.2613 -0.1977 -0.4545 -0.4410 -0.4151 -0.2553 0.0481 0.1954 -0.0861 -0.0920 -0.0719 -0.3206 -0.2219 -0.1794 -0.0125 -0.1378 0.4127 -0.2220 0.2612 0.3452 0.1793 -0.2734 0.0556 0.0860 0.0801 0.0874 0.0792 0.0892 0.0984 0.1626 0.1313 0.1424 0.0950 0.0950 0.1027 0.0791 0.1017 0.0978 0.0955 0.1910 0.1925 0.1382
va: 0.9991 3.2019 2.9983 2.9294 3.0015 3.2125 3.8956 3.7410 3.9366 3.7682 3.7908 3.9580 4.0059 3.9481 3.7666 3.8890 4.1830 3.9080 4.0208 4.3361 4.0111 3.9006 1.0272 1.0409 1.0068 1.0102 1.0041 1.0057 1.0021 1.0309 1.0176 1.0018 1.0011 1.0012 0.9923 1.0086 1.0066 1.0110 1.0163 1.0107 1.0088 0.9994
dispcorr: -0.018245632 hartree
energy: -995.563395799917
dipole: -19.73078 18.16860 -1.56218 0.21127 0.31016 0.52144 0.00384 -0.12952 -0.12568
magnitude: 1.65170 au
magnitude: 4.19829 debye
