program: Orca
programVersion: 5.0.2
elementType: F N N N N N C C C C C C C C C C C C C C C C H H H H H H H H H H H H H H H H H H H H
charge: 0
multiplicity: 1
keywords: wb97x-d3
keywords: def2-TZVPP
keywords: def2/J RIJCOSX
keywords: DEFGRID2
keywords: scfconv7
keywords: smallprint printgap noloewdin
keywords: NOSOSCF
formula: C16H20FN5
InChI: InChI=1/C16H20FN5/c1-8-4-5-11-7-9(2)13(12(11)6-8)19-16-21-14(10(3)17)20-15(18)22-16/h4-6,9-10,13,19H,7,18H2,1-3H3
42 atoms
F  2.867602 1.219349 -2.543983
N  -0.163296 -0.436462 0.886587
N  1.696348 0.350082 -0.228928
N  1.787226 -1.573474 1.146777
N  3.732573 -0.800529 0.037573
N  3.785746 -2.652028 1.377312
C  -1.376182 1.656011 1.547028
C  -1.05137 0.611008 0.454745
C  -2.774721 2.17137 1.170869
C  -2.415036 0.10257 0.059068
C  -3.396908 0.99651 0.47278
C  -0.327462 2.739365 1.701761
C  -2.740496 -1.055713 -0.622564
C  -4.727406 0.722958 0.206864
C  -4.079046 -1.343181 -0.899502
C  -5.057155 -0.445335 -0.473813
C  1.137841 -0.550555 0.589124
C  -4.447803 -2.585604 -1.656616
C  2.983611 0.158808 -0.460391
C  3.076317 -1.655858 0.845348
C  3.637542 1.168589 -1.378605
C  5.069705 0.879792 -1.739629
H  -1.468862 1.108498 2.492272
H  -0.582098 1.106975 -0.399356
H  -2.696635 3.022501 0.484645
H  -3.342483 2.515266 2.037226
H  -0.17826 3.280042 0.764692
H  0.636898 2.329677 2.005764
H  -0.623219 3.466618 2.460315
H  -0.520831 -1.104713 1.553643
H  -1.964452 -1.745893 -0.937191
H  -5.509696 1.39911 0.531418
H  -4.228396 -2.478937 -2.721363
H  -3.889664 -3.453415 -1.302955
H  -5.509852 -2.812398 -1.565555
H  3.561833 2.152218 -0.905365
H  5.186639 -0.097062 -2.207642
H  5.696863 0.905629 -0.849823
H  5.441008 1.642651 -2.424523
H  4.756473 -2.766652 1.142661
H  3.338258 -3.340925 1.956864
H  -6.099714 -0.665903 -0.672448
elementType: F N C H
totalener: -995.54302786 hartree
nucrepener: 1776.34214483 hartree
electener: -2771.88517270 hartree
oneelecener: -4883.71415462 hartree
twoeener: 2111.82898192 hartree
cpcmener: -0.02785003 hartree
kineticenergy: 991.21478923 hartree
xcener: -96.217488835985 hartree
chargesum: 0.0000000
charge: -0.268160 -0.197114 -0.429416 -0.441080 -0.417512 -0.254431 0.042003 0.207105 -0.079251 -0.093163 -0.075436 -0.320592 -0.220137 -0.181026 -0.017491 -0.133191 0.402270 -0.221197 0.230238 0.346487 0.192779 -0.249947 0.056004 0.086666 0.080038 0.087522 0.080439 0.088066 0.098061 0.160485 0.128613 0.142004 0.102837 0.098131 0.091313 0.083363 0.087707 0.086782 0.100504 0.191503 0.190714 0.137510
qa: -0.2682 -0.1971 -0.4294 -0.4411 -0.4175 -0.2544 0.0420 0.2071 -0.0793 -0.0932 -0.0754 -0.3206 -0.2201 -0.1810 -0.0175 -0.1332 0.4023 -0.2212 0.2302 0.3465 0.1928 -0.2499 0.0560 0.0867 0.0800 0.0875 0.0804 0.0881 0.0981 0.1605 0.1286 0.1420 0.1028 0.0981 0.0913 0.0834 0.0877 0.0868 0.1005 0.1915 0.1907 0.1375
va: 0.9826 3.1988 2.9788 2.9831 2.9656 3.2108 3.8991 3.7232 3.9289 3.7600 3.7870 3.9613 3.9974 3.9475 3.7701 3.8767 4.1937 3.9092 4.0856 4.3409 3.9575 3.9302 1.0269 1.0446 1.0069 1.0101 1.0034 1.0062 1.0017 1.0320 1.0184 1.0020 0.9928 0.9977 1.0043 0.9975 1.0140 1.0158 1.0075 1.0104 1.0106 1.0001
dispcorr: -0.018198431 hartree
energy: -995.561226295988
dipole: -10.11038 10.24134 0.13096 3.09210 -3.78849 -0.69639 3.96522 -2.52126 1.44395
magnitude: 1.60845 au
magnitude: 4.08835 debye
