program: Orca
programVersion: 5.0.2
elementType: F N N N N N C C C C C C C C C C C C C C C C H H H H H H H H H H H H H H H H H H H H
charge: 0
multiplicity: 1
keywords: wb97x-d3
keywords: def2-TZVPP
keywords: def2/J RIJCOSX
keywords: DEFGRID2
keywords: scfconv7
keywords: smallprint printgap noloewdin
keywords: NOSOSCF
formula: C16H20FN5
InChI: InChI=1/C16H20FN5/c1-8-4-5-11-7-9(2)13(12(11)6-8)19-16-21-14(10(3)17)20-15(18)22-16/h4-6,9-10,13,19H,7,18H2,1-3H3
42 atoms
F  2.605059 -2.609037 1.898559
N  0.355745 1.888669 -1.009414
N  0.983852 0.113316 0.304679
N  2.403856 0.958291 -1.385623
N  3.045781 -0.942376 -0.114027
N  4.425706 -0.055411 -1.700468
C  -1.018619 2.441457 1.039567
C  -0.964328 1.990693 -0.437457
C  -2.360266 1.886171 1.545756
C  -1.784951 0.724269 -0.444647
C  -2.5757 0.667134 0.693965
C  -0.831449 3.934463 1.22847
C  -1.825937 -0.273447 -1.396424
C  -3.407923 -0.418298 0.894735
C  -2.661142 -1.374157 -1.208703
C  -3.440075 -1.432416 -0.055701
C  1.272785 0.958796 -0.682753
C  -2.716006 -2.468731 -2.235202
C  1.901529 -0.81626 0.517292
C  3.255062 -0.001857 -1.048958
C  1.524882 -1.819866 1.576883
C  0.367987 -2.684096 1.114444
H  -0.223753 1.905329 1.562101
H  -1.48358 2.741555 -1.046332
H  -3.165726 2.612465 1.382078
H  -2.344426 1.671089 2.615848
H  -1.616274 4.501344 0.721753
H  0.129983 4.266179 0.833182
H  -0.858773 4.208477 2.283625
H  0.613989 2.504455 -1.759664
H  -1.19406 -0.217521 -2.276855
H  -4.022679 -0.490962 1.783809
H  -3.179375 -2.120987 -3.160354
H  -1.71836 -2.828439 -2.490172
H  -3.293512 -3.321999 -1.881951
H  1.230499 -1.263387 2.472667
H  -0.499367 -2.06386 0.893698
H  0.095095 -3.399718 1.88902
H  0.632999 -3.237318 0.213087
H  5.096954 -0.756376 -1.449865
H  4.648323 0.633637 -2.393119
H  -4.082621 -2.289885 0.105058
totalener: -995.50736900 hartree
nucrepener: 1870.59505018 hartree
electener: -2866.10241918 hartree
oneelecener: -5071.53455209 hartree
twoeener: 2205.43213290 hartree
kineticenergy: 991.28665160 hartree
xcener: -96.231936240314 hartree
chargesum: -0.0000000
charge: -0.224077 -0.225853 -0.415028 -0.394929 -0.334850 -0.258866 -0.041121 0.263566 -0.096508 -0.031983 -0.074675 -0.291442 -0.217219 -0.140900 -0.019930 -0.091489 0.393290 -0.226384 0.174335 0.360136 0.209126 -0.245301 0.082346 0.079933 0.072984 0.079291 0.065246 0.087184 0.091514 0.140302 0.103005 0.112508 0.099673 0.092952 0.078328 0.056584 0.075166 0.092653 0.088560 0.168655 0.160401 0.102818
qa: -0.2241 -0.2259 -0.4150 -0.3949 -0.3349 -0.2589 -0.0411 0.2636 -0.0965 -0.0320 -0.0747 -0.2914 -0.2172 -0.1409 -0.0199 -0.0915 0.3933 -0.2264 0.1743 0.3601 0.2091 -0.2453 0.0823 0.0799 0.0730 0.0793 0.0652 0.0872 0.0915 0.1403 0.1030 0.1125 0.0997 0.0930 0.0783 0.0566 0.0752 0.0927 0.0886 0.1687 0.1604 0.1028
va: 1.0533 3.1855 2.9278 3.0275 3.0441 3.1821 3.8604 3.7640 3.9251 3.6612 3.8557 3.9523 4.0009 4.0000 3.8004 3.9028 4.1704 3.9210 4.0709 4.2943 4.0328 3.8950 1.0389 0.9987 1.0070 1.0106 1.0071 1.0084 1.0038 1.0421 1.0195 1.0082 0.9940 0.9976 1.0087 1.0061 1.0175 1.0117 1.0136 1.0274 1.0315 1.0090
dispcorr: -0.021650720 hartree
energy: -995.529019718295
dipole: -17.11209 16.78691 -0.32518 5.48423 -4.62958 0.85464 -1.19910 0.47668 -0.72242
magnitude: 1.16535 au
magnitude: 2.96209 debye
