program: Gaussian 09
title: 000055422
version: EM64L-G09RevD.01
frameworkgroup: C1[X(C22H29N3O3)]
method: RPBEPBE
basis: SDD
operation: Freq
keyword: #p
keyword: freq=noraman
keyword: PBEPBE/SDD
title: #p freq=noraman PBEPBE/SDD
converged: YES YES NO NO
title: Mulliken charges:
elementType: O O O N N N C C C C C C C C C C C C C C C C C C C C C C H H H H H H H H H H H H H H H H H H H H H H H H H H H H H
charge: -0.262951 -0.279099 -0.260552 -0.071253 -0.179911 -0.448347 -0.363605 -0.361961 -0.380989 -0.405085 -0.328021 -0.430527 0.506841 -0.301968 -0.528131 -0.402496 0.343365 -0.224684 -0.397026 0.360407 -0.385253 -0.324503 -0.536607 -0.322719 -0.456906 0.480734 0.214591 -0.782074 0.186633 0.208327 0.211364 0.184473 0.208452 0.216805 0.211986 0.214700 0.171374 0.201801 0.234939 0.222373 0.199627 0.203628 0.239928 0.230918 0.214813 0.239385 0.251194 0.247393 0.219267 0.218676 0.240189 0.311434 0.214694 0.298838 0.257545 0.210403 0.257571
chargesum: 0.00000
title: Mulliken charges with hydrogens summed into heavy atoms:
elementType: O O O N N N C C C C C C C C C C C C C C C C C C C C C C
charge: -0.262951 -0.279099 -0.260552 -0.071253 -0.179911 -0.149509 0.031355 0.033876 0.044268 0.021601 0.045153 0.026785 0.506841 0.101287 -0.288204 -0.171578 0.343365 -0.009872 -0.157641 0.360407 -0.134059 -0.077110 0.141525 -0.011285 -0.242212 0.480734 0.214591 -0.056554
polarizability: 4.75868850e+02 -6.15769121e+00 2.51382592e+02 2.15564435e-01 6.91073092e+00 1.52290687e+02
1716.lowfreq: -13.0052 -0.0013 -0.0007 0.0011 2.7939 3.0496 9.5520 15.3552 17.9125
frequency: 7.9988 12.6048 17.7529 27.9136 43.8781 48.8208 62.9226 67.8970 72.5519 83.2598 88.7163 104.0593 110.5119 131.3303 137.3509 165.2032 189.9014 195.3474 198.8632 221.0280 226.2837 248.5613 261.3973 270.8639 294.7759 305.8986 333.8940 347.1368 373.4415 380.2077 390.4060 415.1590 444.8945 447.4002 458.3852 470.6345 494.9307 522.5288 523.9146 546.4477 556.7160 593.3013 611.5965 621.1125 628.8797 635.0130 644.6630 681.8778 694.8342 722.8253 752.7899 763.4067 777.3517 781.1705 803.6607 811.6417 829.6701 835.5873 842.4243 851.5231 854.5057 884.0446 920.3719 933.4058 939.4472 948.5570 956.8276 976.2054 977.3541 989.0773 991.0871 1002.2843 1006.2402 1024.0579 1038.8729 1050.9585 1058.4176 1069.5633 1082.0301 1087.4657 1099.2790 1112.4753 1119.0396 1122.8112 1140.0558 1151.8338 1154.7901 1172.2445 1181.8914 1182.2722 1195.0384 1202.7852 1213.5134 1215.4093 1219.1878 1250.8066 1264.8403 1269.5455 1277.2688 1286.0540 1291.5651 1298.5742 1305.7021 1307.5517 1344.1049 1345.4712 1362.1876 1364.0108 1369.8667 1376.3284 1386.6464 1388.7121 1392.3385 1400.1050 1423.2179 1433.9130 1448.9447 1452.8271 1453.7043 1459.2769 1463.0196 1464.5603 1467.4559 1470.0906 1471.0042 1476.4323 1478.4139 1489.4868 1490.3184 1497.6728 1508.4590 1575.1018 1590.6051 1621.8150 1625.7942 1629.7759 2825.5612 2846.2539 2859.6479 2912.0669 2922.3710 2939.0099 2955.8033 2994.0893 2995.3124 2997.9566 3013.0749 3030.5238 3041.8404 3052.1572 3058.9176 3080.8345 3092.5594 3095.5073 3097.6482 3110.2870 3118.6885 3128.4934 3160.6016 3166.0341 3168.1162 3169.0578 3177.6600 3196.1799 3535.1254
redmass: 5.0264 4.6797 4.7675 5.0042 3.5347 3.8159 2.3310 2.3585 2.9742 2.1852 4.6137 4.4790 2.3609 4.7738 2.5555 2.8926 3.4389 4.9299 1.7465 2.5806 3.5636 2.6776 1.7982 3.1862 3.1318 3.4673 4.8767 4.3738 5.1484 4.1634 2.0174 3.0613 3.5202 3.0588 4.1838 3.3344 3.8182 2.4088 4.1663 4.4550 4.4731 3.2854 3.8450 5.4595 2.8478 1.1787 5.8292 1.8126 4.0552 3.6401 1.6313 3.8043 1.1608 4.0004 1.3847 4.5004 1.5007 5.3474 1.6129 1.7119 1.4816 1.2297 1.3784 6.5796 3.6952 1.3450 2.1917 6.4297 5.5694 1.3074 1.7457 2.3505 2.9605 3.2016 1.6240 1.8644 2.1537 2.3560 2.8051 2.3114 1.7025 1.2588 1.9488 1.2941 2.5584 1.5288 2.4057 1.6190 1.3845 1.3793 1.3451 1.2299 2.5215 1.9551 3.1538 1.5513 1.2973 2.0901 1.2499 1.2489 1.2616 1.3443 1.4195 1.4112 1.3228 1.3686 1.7592 2.5022 1.8000 1.5819 1.5448 1.2599 3.9500 1.5729 4.0561 1.2790 1.0452 1.3940 1.2190 1.2815 1.1857 1.0518 1.1058 1.0972 1.0923 1.1171 1.1259 1.3610 2.1147 1.8479 2.4329 5.8293 6.5833 4.6295 6.6791 6.4423 1.0707 1.0712 1.0694 1.0692 1.0709 1.0548 1.0329 1.0362 1.1060 1.0859 1.0610 1.0891 1.1037 1.0892 1.0897 1.1040 1.0892 1.1003 1.0980 1.0898 1.0991 1.0875 1.0907 1.0930 1.0907 1.0904 1.0957 1.0954 1.0765
irintensity: 0.4115 1.4139 3.3822 0.1317 1.4352 0.5187 5.7404 0.8247 5.0012 0.9448 2.6655 0.6427 0.4831 3.9221 5.2615 6.1278 1.7382 0.5551 0.6983 6.0960 0.2208 2.1013 0.6530 1.3480 15.4843 3.1321 0.3097 0.9050 2.0968 0.4657 1.9144 0.0011 0.5496 8.8118 2.7359 1.8824 0.4586 31.0788 28.3095 4.1530 14.6879 0.0348 0.5708 8.2831 5.2804 56.6583 1.3864 30.8728 3.0737 0.1846 37.8787 26.1351 17.3520 12.1433 33.7101 11.4941 2.9640 4.0926 6.6437 27.4613 65.5716 0.8654 1.6029 5.7356 10.9203 0.6896 5.3440 167.7753 19.6621 2.4853 12.4021 57.4458 26.0709 78.4931 14.6401 0.5178 13.0862 3.8340 4.8543 2.9678 10.8694 0.3188 31.1832 23.3593 83.4621 35.9692 26.0839 101.1162 182.4561 3.2207 86.7595 37.8172 70.0073 24.1338 320.9274 59.4065 33.1180 7.0897 6.3594 2.9027 3.9719 4.7929 11.0821 27.2174 13.2793 2.2063 8.3796 65.4725 29.6085 16.6155 180.0762 10.3669 65.2690 4.7213 5.2720 8.6343 14.9023 7.5565 19.9457 2.5234 62.2562 12.7435 21.7358 22.6639 0.3186 20.1661 42.8963 188.6156 72.4355 18.5865 489.5508 80.9858 78.2826 160.3738 383.8355 2.6851 70.4651 51.6250 138.4151 56.2543 102.3031 43.0368 81.0569 16.9234 26.0906 23.7044 22.3757 52.1197 52.6941 43.7488 23.4221 40.3681 18.8515 21.5426 8.2251 26.2074 29.6305 15.5024 4.5099 14.4250 18.5046 13.4301 6.6737 7.8423 10.5869
temp: 298.150 k
press: 1.00000 atm
elementType: 8 8 8 7 7 7 6 6 6 6 6 6 6 6 6 6 6 6 6 6 6 6 6 6 6 6 6 6 1 1 1 1 1 1 1 1 1 1 1 1 1 1 1 1 1 1 1 1 1 1 1 1 1 1 1 1 1
symmnumber: 1
zpe: 1246948.3 jmol-1
zpe.correction: 0.474938 hartree
zpe.thermalcorrener: 0.502884 hartree
zpe.thermalcorrenthalpy: 0.503828 hartree
zpe.thermalcorrgfe: 0.411502 hartree
zpe.sumelectzpe: -1243.537706 hartree
zpe.sumelectthermal: -1243.509760 hartree
zpe.sumelectthermalent: -1243.508815 hartree
zpe.sumelectthermalfe: -1243.601142 hartree
dipole: 0.5680 -4.6411 -1.5561
dipole: 4.9279
quadrupole: -147.3182 -159.8681 -173.8067
quadrupole: 42.4060 10.6393 -0.1267
quadrupole: 13.0128 0.4629 -13.4757 42.4060 10.6393 -0.1267
hfenergy: -1244.0126436 hartree
pointgroup: C01 [X(C22H29N3O3)]
dipole: 0.2198023 -1.8538145 -0.5233603 debye
polarizability: 475.8446913|-6.5693412|251.8425692|0.4416649|2.0991862|151.8548684 unknown
InChI: InChI=1S/C22H29N3O3/c1-18(26)23-19-7-9-21(10-8-19)28-16-4-11-24-12-14-25(15-13-24)20-5-3-6-22(17-20)27-2/h3,5-10,17,23H,4,11-16H2,1-2H3
charge 0 multiplicity 1
57 atoms
O  -3.204521 0.449253 0.286776
O  9.075742 -1.329453 -0.023315
O  -9.721836 1.545797 0.155562
N  1.632434 -0.506782 0.357197
N  4.453262 0.099952 0.005475
N  -8.758761 -0.561821 -0.234311
C  2.654608 -1.582407 0.377294
C  2.076507 0.567417 -0.562964
C  4.006856 -1.029331 0.852935
C  3.430116 1.154804 -0.123019
C  0.283934 -1.034661 0.03498
C  -0.838268 -0.005572 0.286897
C  5.827061 0.444838 -0.050952
C  -2.2229 -0.632377 0.103701
C  6.832199 -0.561233 0.004428
C  6.252732 1.804065 -0.201677
C  8.199966 -0.227194 -0.089273
C  7.621939 2.113329 -0.303323
C  8.621644 1.116658 -0.248802
C  -4.565835 0.128834 0.146776
C  -5.470165 1.203099 0.33084
C  -5.064378 -1.161696 -0.159064
C  10.508111 -1.056349 -0.138555
C  -6.857062 1.009875 0.212334
C  -6.456614 -1.356468 -0.278155
C  -7.364733 -0.283619 -0.09656
C  -9.839131 0.312126 -0.111715
C  -11.208122 -0.333724 -0.3256
H  2.784557 -2.044358 -0.635348
H  2.324736 -2.373287 1.076737
H  1.332339 1.382474 -0.564007
H  2.171477 0.182825 -1.611744
H  4.751462 -1.839023 0.82618
H  3.902722 -0.696256 1.910906
H  3.292529 1.705423 0.836441
H  3.749015 1.877003 -0.893544
H  0.226734 -1.398188 -1.026061
H  0.115373 -1.916703 0.68486
H  -0.741715 0.390969 1.313366
H  -0.757009 0.850143 -0.407791
H  -2.331914 -1.068435 -0.912697
H  -2.403466 -1.43206 0.853214
H  6.586718 -1.622752 0.089842
H  5.527774 2.621319 -0.211431
H  7.920965 3.162431 -0.412748
H  9.677886 1.387751 -0.3219
H  -5.064857 2.191585 0.56781
H  -4.392566 -2.012195 -0.305155
H  10.754239 -0.587609 -1.11166
H  10.863731 -0.405232 0.684121
H  10.995669 -2.040234 -0.068001
H  -7.555015 1.836698 0.352938
H  -6.8350 -2.35954 -0.51579
H  -8.988255 -1.533496 -0.453119
H  -11.722131 0.184366 -1.153536
H  -11.168266 -1.413638 -0.552843
H  -11.819022 -0.184145 0.581352
