program: Orca
programVersion: 5.0.2
elementType: F N N N N N C C C C C C C C C C C C C C C C H H H H H H H H H H H H H H H H H H H H
charge: 0
multiplicity: 1
keywords: wb97x-d3
keywords: def2-TZVPP
keywords: def2/J RIJCOSX
keywords: DEFGRID2
keywords: scfconv7
keywords: smallprint printgap noloewdin
keywords: NOSOSCF
formula: C16H20FN5
InChI: InChI=1/C16H20FN5/c1-8-4-5-11-7-9(2)13(12(11)6-8)19-16-21-14(10(3)17)20-15(18)22-16/h4-6,9-10,13,19H,7,18H2,1-3H3
42 atoms
F  2.565239 1.731797 -2.21076
N  0.008284 0.02565 1.472822
N  1.525926 0.292149 -0.236043
N  1.875032 -1.275882 1.506761
N  3.476849 -1.030866 -0.221779
N  3.763163 -2.558013 1.453411
C  -1.646675 1.778668 2.028722
C  -0.946288 0.955509 0.929193
C  -2.996739 2.164402 1.403993
C  -2.104192 0.332148 0.188083
C  -3.274239 1.027074 0.462315
C  -0.823412 2.937905 2.554935
C  -2.098255 -0.747968 -0.673453
C  -4.462521 0.630182 -0.12437
C  -3.287757 -1.158145 -1.273325
C  -4.459006 -0.460268 -0.984682
C  1.168791 -0.326787 0.895301
C  -3.300435 -2.310593 -2.235531
C  2.681072 -0.104805 -0.725483
C  3.012807 -1.591063 0.90278
C  3.140875 0.494017 -2.029299
C  2.770752 -0.414631 -3.185582
H  -1.862032 1.090748 2.856984
H  -0.397505 1.616601 0.252143
H  -2.905023 3.105512 0.849585
H  -3.776765 2.313698 2.152918
H  -0.598668 3.651629 1.760303
H  0.12479 2.593143 2.968533
H  -1.351779 3.474896 3.343651
H  -0.272028 -0.541986 2.256416
H  -1.175278 -1.278237 -0.881593
H  -5.388357 1.151956 0.08588
H  -4.279748 -2.786066 -2.282544
H  -3.051277 -1.980476 -3.246157
H  -2.574463 -3.074482 -1.957442
H  4.226081 0.622572 -1.98537
H  1.691424 -0.56304 -3.228062
H  3.249133 -1.385713 -3.066634
H  3.098239 0.015367 -4.131794
H  4.663583 -2.763432 1.064241
H  3.497783 -2.951163 2.336317
H  -5.389172 -0.780515 -1.439269
totalener: -995.51147609 hartree
nucrepener: 1802.36036444 hartree
electener: -2797.87184053 hartree
oneelecener: -4934.93614117 hartree
twoeener: 2137.06430064 hartree
kineticenergy: 991.27605173 hartree
xcener: -96.225814179881 hartree
chargesum: 0.0000000
charge: -0.225567 -0.197430 -0.365467 -0.401554 -0.390065 -0.264031 0.027534 0.203596 -0.103981 -0.068609 -0.111249 -0.286649 -0.172291 -0.124836 0.010288 -0.104158 0.381174 -0.226405 0.186972 0.361834 0.207476 -0.283386 0.045444 0.093675 0.077257 0.078742 0.075330 0.089319 0.088865 0.131975 0.109285 0.113472 0.081856 0.100612 0.086196 0.063025 0.094639 0.093865 0.093454 0.163827 0.162232 0.103734
qa: -0.2256 -0.1974 -0.3655 -0.4016 -0.3901 -0.2640 0.0275 0.2036 -0.1040 -0.0686 -0.1112 -0.2866 -0.1723 -0.1248 0.0103 -0.1042 0.3812 -0.2264 0.1870 0.3618 0.2075 -0.2834 0.0454 0.0937 0.0773 0.0787 0.0753 0.0893 0.0889 0.1320 0.1093 0.1135 0.0819 0.1006 0.0862 0.0630 0.0946 0.0939 0.0935 0.1638 0.1622 0.1037
va: 1.0482 3.1931 3.0050 3.0056 2.9957 3.1839 3.9193 3.7571 3.9283 3.8566 3.8837 3.9563 4.0017 3.9892 3.8086 3.9432 4.1801 3.9180 4.1027 4.3031 3.9914 3.9045 1.0233 1.0336 1.0060 1.0102 1.0080 1.0099 1.0021 1.0513 1.0209 1.0077 1.0053 0.9914 1.0025 1.0086 1.0117 1.0172 1.0080 1.0305 1.0308 1.0077
dispcorr: -0.018498018 hartree
energy: -995.529974105602
dipole: -13.16709 13.16805 0.00096 -0.74202 -0.11882 -0.86084 0.57490 0.09065 0.66555
magnitude: 1.08812 au
magnitude: 2.76578 debye
