program: Orca
programVersion: 5.0.2
elementType: F N N N N N C C C C C C C C C C C C C C C C H H H H H H H H H H H H H H H H H H H H
charge: 0
multiplicity: 1
keywords: wb97x-d3
keywords: def2-TZVPP
keywords: def2/J RIJCOSX
keywords: DEFGRID2
keywords: scfconv7
keywords: smallprint printgap noloewdin
keywords: NOSOSCF
formula: C16H20FN5
InChI: InChI=1/C16H20FN5/c1-8-4-5-11-7-9(2)13(12(11)6-8)19-16-21-14(10(3)17)20-15(18)22-16/h4-6,9-10,13,19H,7,18H2,1-3H3
42 atoms
F  5.516423 -1.147345 0.153617
N  -0.117339 -0.130884 0.566483
N  2.026576 -0.859357 0.325135
N  1.38828 1.286841 -0.4430
N  3.617998 0.526951 -0.724343
N  2.963833 2.584014 -1.464145
C  -1.609602 1.428143 1.844014
C  -1.23125 0.773494 0.49643
C  -3.108135 1.739954 1.696156
C  -2.516433 0.109205 0.074998
C  -3.589128 0.668412 0.758929
C  -0.741658 2.612506 2.223572
C  -2.703227 -0.897597 -0.85149
C  -4.870103 0.212467 0.511022
C  -3.990655 -1.370497 -1.108435
C  -5.059188 -0.804401 -0.418646
C  1.129726 0.118796 0.132513
C  -4.208082 -2.464412 -2.114179
C  3.236976 -0.580289 -0.121624
C  2.642842 1.433079 -0.856826
C  4.252268 -1.682976 0.03497
C  4.204071 -2.618801 -1.156042
H  -1.510114 0.651704 2.612112
H  -0.963023 1.551375 -0.224742
H  -3.250393 2.731012 1.249578
H  -3.631629 1.748395 2.653997
H  -1.042343 3.03184 3.184501
H  -0.812973 3.40531 1.476608
H  0.307977 2.328574 2.301162
H  -0.244621 -1.015561 1.0309
H  -1.853274 -1.324028 -1.374077
H  -5.72032 0.629485 1.037012
H  -3.92659 -2.141243 -3.117847
H  -3.610046 -3.346406 -1.881265
H  -5.251248 -2.775362 -2.151742
H  4.024056 -2.230617 0.953245
H  3.216471 -3.070688 -1.237715
H  4.936324 -3.418371 -1.047148
H  4.414138 -2.078523 -2.079024
H  3.913511 2.746176 -1.740968
H  2.281281 3.312674 -1.549869
H  -6.061663 -1.169686 -0.606768
totalener: -995.51208106 hartree
nucrepener: 1767.58818943 hartree
electener: -2763.10027049 hartree
oneelecener: -4865.12170436 hartree
twoeener: 2102.02143387 hartree
kineticenergy: 991.27547462 hartree
xcener: -96.226265951701 hartree
chargesum: 0.0000000
charge: -0.225604 -0.206244 -0.404765 -0.407582 -0.355581 -0.264274 0.029962 0.157723 -0.096437 -0.064669 -0.058100 -0.280633 -0.197921 -0.145828 -0.000225 -0.090127 0.399688 -0.221639 0.209851 0.356503 0.192324 -0.283761 0.047086 0.081608 0.074222 0.080192 0.091043 0.068423 0.090012 0.143498 0.113565 0.114103 0.098471 0.095284 0.077581 0.063958 0.091635 0.093144 0.097318 0.168354 0.162264 0.105577
qa: -0.2256 -0.2062 -0.4048 -0.4076 -0.3556 -0.2643 0.0300 0.1577 -0.0964 -0.0647 -0.0581 -0.2806 -0.1979 -0.1458 -0.0002 -0.0901 0.3997 -0.2216 0.2099 0.3565 0.1923 -0.2838 0.0471 0.0816 0.0742 0.0802 0.0910 0.0684 0.0900 0.1435 0.1136 0.1141 0.0985 0.0953 0.0776 0.0640 0.0916 0.0931 0.0973 0.1684 0.1623 0.1056
va: 1.0484 3.1798 3.0161 2.9598 3.0343 3.1899 3.9187 3.7871 3.9294 3.7975 3.8485 3.9673 4.0230 4.0017 3.8238 3.9295 4.1752 3.9197 4.0820 4.2888 4.0069 3.9029 1.0282 1.0414 1.0061 1.0104 1.0021 1.0083 1.0094 1.0460 1.0215 1.0088 0.9939 0.9963 1.0091 1.0100 1.0161 1.0082 1.0133 1.0277 1.0301 1.0082
dispcorr: -0.018244131 hartree
energy: -995.530325189325
dipole: -19.52825 18.36818 -1.16008 0.10531 0.32660 0.43191 -0.14556 -0.06598 -0.21154
magnitude: 1.25581 au
magnitude: 3.19203 debye
