program: Orca
programVersion: 5.0.2
elementType: F N N N N N C C C C C C C C C C C C C C C C H H H H H H H H H H H H H H H H H H H H
charge: 0
multiplicity: 1
keywords: wb97x-d3
keywords: def2-TZVPP
keywords: def2/J RIJCOSX
keywords: DEFGRID2
keywords: scfconv7
keywords: smallprint printgap noloewdin
keywords: NOSOSCF
formula: C16H20FN5
InChI: InChI=1/C16H20FN5/c1-8-4-5-11-7-9(2)13(12(11)6-8)19-16-21-14(10(3)17)20-15(18)22-16/h4-6,9-10,13,19H,7,18H2,1-3H3
42 atoms
F  3.099373 2.015708 -1.698162
N  -0.031591 -0.137056 1.318262
N  1.655592 0.293998 -0.187969
N  1.836644 -1.432393 1.422319
N  3.600189 -1.034503 -0.111204
N  3.726379 -2.713339 1.434298
C  -1.536553 1.781963 1.817428
C  -0.945833 0.823815 0.763208
C  -2.882152 2.213957 1.211707
C  -2.175114 0.225044 0.127375
C  -3.280306 1.02494 0.381921
C  -0.606196 2.91445 2.204952
C  -2.281174 -0.924831 -0.631755
C  -4.515361 0.669604 -0.131276
C  -3.519538 -1.29793 -1.150681
C  -4.624148 -0.488044 -0.891465
C  1.187438 -0.428661 0.834036
C  -3.665702 -2.562359 -1.947702
C  2.856458 -0.05911 -0.597516
C  3.028904 -1.695392 0.906291
C  3.420621 0.67645 -1.785631
C  2.860122 0.103436 -3.071017
H  -1.75947 1.182527 2.709422
H  -0.386004 1.393081 0.015602
H  -2.747473 3.096507 0.575779
H  -3.618243 2.48219 1.97178
H  -0.368805 3.539644 1.342371
H  0.334037 2.53211 2.603706
H  -1.052409 3.553865 2.967552
H  -0.366956 -0.752464 2.04202
H  -1.406611 -1.538155 -0.821214
H  -5.391394 1.27896 0.055629
H  -3.906779 -3.410098 -1.3030
H  -4.461751 -2.48241 -2.687634
H  -2.746202 -2.810937 -2.476914
H  4.509248 0.582176 -1.766933
H  1.773563 0.186564 -3.086281
H  3.126333 -0.94964 -3.160709
H  3.263011 0.629665 -3.936189
H  4.666212 -2.875678 1.126089
H  3.382082 -3.177995 2.253022
H  -5.591051 -0.770433 -1.291325
totalener: -995.51175940 hartree
nucrepener: 1794.55126002 hartree
electener: -2790.06301942 hartree
oneelecener: -4919.26153645 hartree
twoeener: 2129.19851703 hartree
kineticenergy: 991.27750276 hartree
xcener: -96.225505589243 hartree
chargesum: 0.0000000
charge: -0.229156 -0.201813 -0.372878 -0.400789 -0.375343 -0.261683 0.019949 0.177653 -0.095281 -0.063549 -0.090326 -0.283238 -0.181104 -0.136473 0.011231 -0.103845 0.379290 -0.226309 0.192405 0.364088 0.197925 -0.285181 0.044550 0.096509 0.076585 0.078832 0.076382 0.088917 0.088851 0.136137 0.113482 0.113738 0.099300 0.085231 0.085668 0.065668 0.099960 0.090320 0.093011 0.164148 0.162055 0.105082
qa: -0.2292 -0.2018 -0.3729 -0.4008 -0.3753 -0.2617 0.0199 0.1777 -0.0953 -0.0635 -0.0903 -0.2832 -0.1811 -0.1365 0.0112 -0.1038 0.3793 -0.2263 0.1924 0.3641 0.1979 -0.2852 0.0445 0.0965 0.0766 0.0788 0.0764 0.0889 0.0889 0.1361 0.1135 0.1137 0.0993 0.0852 0.0857 0.0657 0.1000 0.0903 0.0930 0.1641 0.1621 0.1051
va: 1.0435 3.1943 3.0095 3.0038 3.0150 3.1843 3.9384 3.7665 3.9178 3.8334 3.8744 3.9648 4.0158 3.9966 3.8007 3.9423 4.1926 3.9176 4.1089 4.2963 3.9750 3.9167 1.0252 1.0391 1.0070 1.0101 1.0079 1.0093 1.0009 1.0489 1.0170 1.0082 0.9917 1.0039 1.0038 1.0103 1.0137 1.0136 1.0085 1.0301 1.0308 1.0072
dispcorr: -0.018379063 hartree
energy: -995.530138463839
dipole: -14.58319 14.37536 -0.20783 -0.63017 -0.34485 -0.97502 -0.83393 1.35491 0.52098
magnitude: 1.12484 au
magnitude: 2.85912 debye
