program: Orca
programVersion: 5.0.2
elementType: Cl F F F F F O O N N N N C C C C C C C C C C C C C C C C C C C H H H H H H H H H H H H H H
charge: 0
multiplicity: 1
keywords: wb97x-d3
keywords: def2-TZVPP
keywords: def2/J RIJCOSX
keywords: DEFGRID2
keywords: scfconv7
keywords: smallprint printgap noloewdin
keywords: NOSOSCF
formula: C19H14ClF5N4O2
InChI: InChI=1/C19H14ClF5N4O2/c20-14-7-6-13(8-12(14)9-31-10-18(21,22)19(23,24)25)29-17(11-4-2-1-3-5-11)27-16(28-29)15(26)30/h1-8H,9-10,26H2
45 atoms
Cl 1.767658 -3.939292 -1.320084
F  4.153599 0.045863 2.62619
F  5.087985 -0.094258 0.657898
F  2.788471 0.858892 -0.486469
F  3.691961 2.144531 0.986622
F  1.889372 1.068962 1.459739
O  2.214919 -1.702735 1.946344
O  -5.330124 0.213651 2.708153
N  -2.348078 0.088251 -0.043085
N  -3.212262 -0.147659 0.939785
N  -3.714597 1.768452 -0.098889
N  -5.937565 2.077221 1.571759
C  -1.340098 -0.860078 -0.350626
C  0.455739 -2.287159 0.400188
C  -0.514788 -1.321669 0.65612
C  1.323907 -2.727644 1.550478
C  -2.649028 1.25122 -0.663237
C  -1.211781 -1.335066 -1.647511
C  0.580924 -2.744717 -0.907953
C  3.328031 -1.559315 1.104906
C  -1.882513 1.840353 -1.76007
C  -0.240081 -2.276669 -1.925488
C  3.907612 -0.177998 1.315145
C  -4.015036 0.882428 0.868672
C  -2.556326 2.363671 -2.860774
C  -0.491269 1.900905 -1.706215
C  3.04572 0.994731 0.812368
C  -1.841453 2.926548 -3.906446
C  0.217722 2.468736 -2.75234
C  -0.454811 2.976802 -3.855814
C  -5.156626 1.024113 1.805067
H  -0.630447 -0.944671 1.664691
H  0.692237 -2.925668 2.416228
H  1.861364 -3.652335 1.325259
H  -1.867828 -0.991373 -2.435709
H  4.107095 -2.294631 1.340898
H  3.084033 -1.675066 0.044011
H  -0.132488 -2.654307 -2.932566
H  -3.636286 2.318408 -2.908021
H  0.038774 1.524813 -0.841369
H  -2.368801 3.322811 -4.763697
H  1.297179 2.517268 -2.701708
H  0.10096 3.415162 -4.67398
H  -5.747154 2.718524 0.819135
H  -6.731229 2.257701 2.166124
elementType: Cl F O N C H
totalener: -2061.56798489 hartree
nucrepener: 3395.67963949 hartree
electener: -5457.24762437 hartree
oneelecener: -9588.66496698 hartree
twoeener: 4131.41734260 hartree
cpcmener: -0.05304750 hartree
kineticenergy: 2054.90254932 hartree
xcener: -164.590124277189 hartree
chargesum: 0.0000000
charge: -0.078755 -0.188621 -0.186577 -0.169981 -0.160752 -0.163622 -0.363450 -0.532838 0.178717 -0.306559 -0.417941 -0.216870 0.043773 0.011286 -0.198118 0.037162 0.479757 -0.174195 0.074894 -0.033006 -0.132470 -0.100364 0.355662 0.269002 -0.194943 -0.208970 0.470069 -0.182696 -0.153706 -0.122147 0.258077 0.138367 0.121164 0.116640 0.165369 0.135046 0.107385 0.145870 0.144561 0.153388 0.160156 0.154803 0.163479 0.201982 0.199971
qa: -0.0788 -0.1886 -0.1866 -0.1700 -0.1608 -0.1636 -0.3634 -0.5328 0.1787 -0.3066 -0.4179 -0.2169 0.0438 0.0113 -0.1981 0.0372 0.4798 -0.1742 0.0749 -0.0330 -0.1325 -0.1004 0.3557 0.2690 -0.1949 -0.2090 0.4701 -0.1827 -0.1537 -0.1221 0.2581 0.1384 0.1212 0.1166 0.1654 0.1350 0.1074 0.1459 0.1446 0.1534 0.1602 0.1548 0.1635 0.2020 0.2000
va: 1.2454 1.1236 1.1231 1.1508 1.1576 1.1515 1.9391 1.9792 3.3845 2.9767 3.0512 3.2368 3.7086 3.5995 4.0012 3.8890 3.6050 3.9829 3.8318 3.9194 3.4847 3.9720 4.2668 3.7491 3.9746 3.8988 4.3972 3.9413 3.9012 3.8877 4.3818 1.0282 0.9956 1.0033 0.9908 1.0060 1.0096 1.0050 1.0196 1.0053 0.9931 1.0001 0.9882 1.0113 1.0000
dispcorr: -0.025186440 hartree
energy: -2061.593171325934
dipole: -28.29938 28.94234 0.64295 4.17102 -3.83751 0.33351 -13.50794 10.29809 -3.20985
magnitude: 3.29056 au
magnitude: 8.36393 debye
