program: Gaussian 09
title: 000055289
version: EM64L-G09RevD.01
frameworkgroup: C1[X(C7H6N2O4)]
method: RPBEPBE
basis: SDD
operation: Freq
keyword: #pfreq=noraman
keyword: PBEPBE/SDD
title: #p freq=noraman PBEPBE/SDD
converged: NO YES NO NO
title: Mulliken charges:
elementType: O O O O N N C C C C C C C H H H H H H
charge: -0.376614 -0.208242 -0.212002 -0.225700 -0.158085 0.022122 0.445237 0.393872 -0.312909 -0.376664 -0.355831 -0.339347 -0.051451 0.311505 0.277844 0.290663 0.289756 0.210347 0.375497
chargesum: 0.00000
title: Mulliken charges with hydrogens summed into heavy atoms:
elementType: O O O O N N C C C C C C C
charge: -0.001116 -0.208242 -0.212002 -0.225700 -0.158085 0.022122 0.445237 0.393872 -0.001403 -0.098820 -0.065168 -0.049591 0.158897
polarizability: 1.90035685e+02 3.44673180e+00 1.17444909e+02 -5.91789415e-01 -5.48324264e-01 4.35609269e+01
1716.lowfreq: -8.8231 -0.0012 -0.0010 -0.0009 4.6008 8.9488 45.1128 71.5498 78.3938
frequency: 45.0853 71.5490 78.3856 146.4176 197.2472 228.2279 233.4632 278.1796 338.5360 351.1917 374.5191 417.7515 444.5500 507.3399 510.1930 561.2042 620.8503 645.2861 666.0072 725.4388 732.1395 796.6700 847.4012 871.5050 945.1065 988.2369 990.6010 1002.8287 1004.3153 1096.1466 1109.7135 1126.3558 1178.8904 1224.5783 1282.7091 1302.2171 1332.8362 1362.2509 1369.3289 1401.3150 1430.7856 1479.4320 1587.3781 1599.7773 1616.5733 2999.4566 3176.3057 3179.4862 3194.7974 3202.4978 3446.0215
redmass: 10.2536 6.7592 5.7035 9.9975 6.0650 6.3794 3.1388 8.4312 4.7159 5.3375 1.3453 2.9474 6.7463 3.6457 6.1818 7.5325 7.1974 8.4098 4.9997 7.0729 5.2694 8.3337 1.2558 1.5708 1.5743 3.9506 1.5454 3.1848 1.3320 3.2776 2.4048 1.5647 1.4599 4.5187 2.1114 1.4625 1.3842 5.3405 1.4546 9.4115 3.9763 2.5519 7.9893 6.6500 7.3955 1.0890 1.0889 1.0906 1.0961 1.0964 1.0683
irintensity: 2.5323 1.3366 1.9923 2.5355 14.0352 2.6506 16.9496 0.6447 22.9990 2.1371 121.4251 4.3846 3.8402 5.5994 1.4884 3.5765 0.3544 5.9395 22.0999 28.2440 7.9705 11.5433 5.8781 83.3348 6.4674 18.3549 3.1698 6.1428 0.3766 13.3751 59.9315 33.2652 211.5156 369.7758 118.1787 45.4896 86.2209 144.4329 45.0044 17.3928 36.7379 86.8970 19.2021 288.8429 94.9935 48.4717 0.8732 2.5853 1.4986 3.1505 18.8070
temp: 298.150 k
press: 1.00000 atm
elementType: 8 8 8 8 7 7 6 6 6 6 6 6 6 1 1 1 1 1 1
symmnumber: 1
zpe: 336862.9 jmol-1
zpe.correction: 0.128304 hartree
zpe.thermalcorrener: 0.139689 hartree
zpe.thermalcorrenthalpy: 0.140633 hartree
zpe.thermalcorrgfe: 0.090117 hartree
zpe.sumelectzpe: -679.666688 hartree
zpe.sumelectthermal: -679.655304 hartree
zpe.sumelectthermalent: -679.654360 hartree
zpe.sumelectthermalfe: -679.704876 hartree
dipole: -5.2683 3.3046 1.9030
dipole: 6.5036
quadrupole: -91.7926 -74.1411 -72.9605
quadrupole: -8.7938 -6.0817 2.7725
quadrupole: -12.1612 5.4903 6.6709 -8.7938 -6.0817 2.7725
hfenergy: -679.7949927 hartree
pointgroup: C01 [X(C7H6N2O4)]
dipole: -2.0824484 -1.3025554 -0.7168268 debye
dipolederiv: -0.5198493 -0.0405753 -0.0700212 -0.0882682 -0.4249863 -0.0261075 -0.1220831 -0.0529879 0.0583245 -0.775 -0.1940867 0.0106701 -0.340406 -0.6807929 0.0450527 0.0242831 0.049117 -0.2371881 -0.8483403 0.2041653 -0.0369973 0.3226609 -0.6438284 0.0551325 -0.0505852 0.0515166 -0.2416183 -0.4246609 -0.0311514 -0.0028673 0.7372575 -1.0435327 -0.0616528 0.0450494 -0.0436726 -0.3310218 -1.5723109 0.5600982 0.0512327 0.7560607 -0.1048406 0.0182586 0.154872 0.0021603 -0.1813503 2.1323781 0.0112009 0.0388177 0.0744561 1.0740847 -0.0998951 0.0430829 -0.1035044 0.207108 1.3991389 -0.071196 0.0461232 0.0546182 0.0185903 -0.031296 0.0171038 0.0042383 0.1200495 -0.9928298 -0.0101762 -0.0205465 -0.0595836 -0.0311546 0.0047661 -0.0172541 0.0105635 0.0441247 -0.4884216 -0.103138 0.0086342 -0.3333818 -0.0415725 -0.0212781 -0.0220529 -0.0055501 -0.1497224 -0.5015042 0.1142825 -0.0335944 0.2952894 -0.027845 -0.0163571 -0.0369439 -0.0527509 -0.1790814 0.3742721 0.0639693 0.0021132 -0.2143985 0.0074983 -0.0219696 0.0387131 -0.002794 -0.0937689 0.3493221 -0.0501733 0.0221524 0.240691 0.0255379 -0.0068103 -0.006865 -0.0171711 -0.0924825 1.2208154 -0.4054843 -0.075254 -1.2441936 1.3755928 0.0982017 -0.1114677 0.1072324 0.1877008 0.1202834 0.0459377 -0.0108763 0.007805 0.0812174 0.0172304 -0.012417 0.0051721 0.1781812 0.0803217 -0.0549746 0.0024238 -0.0463527 0.0201236 0.0181226 0.0030836 0.0227606 0.1715952 0.100541 -0.0502193 0.0049376 -0.0134947 0.0635271 0.0136871 0.0081233 0.0104176 0.1680798 0.0951609 0.059828 -0.0100338 0.0201518 0.0687217 0.0145069 -0.0131009 0.0121405 0.1674805 -0.1230058 -0.0628004 0.0065273 -0.1657448 0.0196061 0.0022494 -0.0191737 0.0004245 0.1324669 0.3736892 0.0144938 0.0665589 -0.0031668 0.2440532 -0.0018416 0.0776323 0.0026878 0.0711228 unknown
polarizability: 189.8947447|-4.3595399|117.3712789|2.3661463|-3.7383483|43.7754975 unknown
InChI: InChI=1S/C7H6N2O4/c10-5-8(11)6-1-3-7(4-2-6)9(12)13/h1-5,11H
charge 0 multiplicity 1
19 atoms
O  -3.07823 -1.660626 -0.052466
O  3.685926 1.258199 -0.124702
O  3.830106 -1.004697 0.138346
O  -3.29443 1.915485 0.023805
N  -2.536276 -0.314693 -0.137498
N  3.152878 0.087709 -0.00105
C  -1.117893 -0.197841 -0.084264
C  1.678019 -0.009835 -0.024355
C  -0.492972 1.077338 -0.218899
C  -0.330959 -1.369798 0.092569
C  0.908471 1.163577 -0.186731
C  1.069901 -1.275803 0.119877
C  -3.521922 0.681869 -0.014332
H  -1.103843 1.973682 -0.334908
H  -0.820503 -2.335271 0.235888
H  1.414014 2.127545 -0.287363
H  1.696194 -2.160781 0.258358
H  -4.528243 0.217859 0.040126
H  -3.077836 -2.005515 -0.990799
