program: Orca
programVersion: 5.0.2
elementType: Cl F F F F F O O N N N N C C C C C C C C C C C C C C C C C C C H H H H H H H H H H H H H H
charge: 0
multiplicity: 1
keywords: wb97x-d3
keywords: def2-TZVPP
keywords: def2/J RIJCOSX
keywords: DEFGRID2
keywords: scfconv7
keywords: smallprint printgap noloewdin
keywords: NOSOSCF
formula: C19H14ClF5N4O2
InChI: InChI=1/C19H14ClF5N4O2/c20-14-7-6-13(8-12(14)9-31-10-18(21,22)19(23,24)25)29-17(11-4-2-1-3-5-11)27-16(28-29)15(26)30/h1-8H,9-10,26H2
45 atoms
Cl 1.781314 -3.568239 1.080539
F  5.022103 0.134176 -0.626775
F  3.794085 1.800428 0.054804
F  4.314287 -1.373583 1.38063
F  2.643167 -0.120362 1.912972
F  4.657095 0.598797 2.159404
O  2.725191 -1.391332 -1.03514
O  -6.801229 -0.462419 0.512686
N  -2.798869 -0.044927 -0.083677
N  -4.025497 -0.461649 0.221065
N  -4.104207 1.562954 -0.722381
N  -6.884453 1.560149 -0.503738
C  -1.68581 -0.879439 0.182958
C  0.410406 -1.851049 -0.507235
C  -0.688774 -1.042433 -0.766641
C  1.521755 -1.960276 -1.515784
C  -2.849829 1.185319 -0.645783
C  -1.617367 -1.538617 1.399367
C  0.460939 -2.513339 0.717734
C  2.675769 0.00482 -0.919671
C  -1.704327 1.987915 -1.076121
C  -0.543048 -2.370685 1.660866
C  3.835578 0.452256 -0.057257
C  -4.775984 0.531214 -0.179585
C  -1.758156 2.61695 -2.318213
C  -0.590592 2.166189 -0.25748
C  3.861598 -0.127594 1.375394
C  -0.701941 3.407343 -2.742711
C  0.460039 2.963192 -0.685433
C  0.40878 3.581058 -1.928182
C  -6.250233 0.493199 -0.020407
H  -0.754996 -0.544874 -1.726029
H  1.746264 -3.004087 -1.737455
H  1.212059 -1.485516 -2.453391
H  -2.390881 -1.412012 2.14389
H  2.762514 0.50055 -1.895909
H  1.746898 0.359046 -0.459779
H  -0.489288 -2.896677 2.603914
H  -2.62053 2.479398 -2.956997
H  -0.547017 1.701489 0.719149
H  -0.747917 3.887386 -3.711105
H  1.318651 3.103845 -0.043423
H  1.232053 4.199927 -2.259738
H  -6.382692 2.326579 -0.921994
H  -7.887348 1.628897 -0.429017
elementType: Cl F O N C H
totalener: -2061.56858931 hartree
nucrepener: 3418.04105970 hartree
electener: -5479.60964901 hartree
oneelecener: -9632.75120415 hartree
twoeener: 4153.14155515 hartree
cpcmener: -0.05544798 hartree
kineticenergy: 2054.88590479 hartree
xcener: -164.589302169361 hartree
chargesum: -0.0000000
charge: -0.078094 -0.190296 -0.187184 -0.157482 -0.164570 -0.162665 -0.353065 -0.531355 0.170432 -0.308714 -0.417867 -0.217357 0.088244 0.020558 -0.155743 0.029460 0.490457 -0.183849 -0.004476 -0.033179 -0.163844 -0.109095 0.365749 0.268278 -0.173359 -0.156407 0.456987 -0.198526 -0.234817 -0.086754 0.259038 0.161844 0.129821 0.111867 0.150227 0.134388 0.096396 0.144445 0.145249 0.160048 0.159258 0.160668 0.164003 0.201721 0.199557
qa: -0.0781 -0.1903 -0.1872 -0.1575 -0.1646 -0.1627 -0.3531 -0.5314 0.1704 -0.3087 -0.4179 -0.2174 0.0882 0.0206 -0.1557 0.0295 0.4905 -0.1838 -0.0045 -0.0332 -0.1638 -0.1091 0.3657 0.2683 -0.1734 -0.1564 0.4570 -0.1985 -0.2348 -0.0868 0.2590 0.1618 0.1298 0.1119 0.1502 0.1344 0.0964 0.1444 0.1452 0.1600 0.1593 0.1607 0.1640 0.2017 0.1996
va: 1.2461 1.1229 1.1166 1.1574 1.1428 1.1520 1.9597 1.9807 3.3987 2.9773 3.0461 3.2353 3.6764 3.5696 3.8959 3.8943 3.6026 4.0469 3.8908 3.9582 3.4827 4.0120 4.2000 3.7504 3.9658 3.8296 4.4338 3.9653 3.9073 3.8421 4.3819 0.9912 0.9931 0.9982 1.0151 1.0100 1.0031 1.0061 1.0183 1.0028 0.9933 1.0038 0.9875 1.0119 1.0002
dispcorr: -0.026649256 hartree
energy: -2061.595238563253
dipole: -32.71125 33.31450 0.60325 14.04129 -11.77254 2.26875 -18.21973 16.13121 -2.08851
magnitude: 3.14214 au
magnitude: 7.98669 debye
