program: Orca
programVersion: 5.0.2
elementType: Cl F F F F F O O N N N N C C C C C C C C C C C C C C C C C C C H H H H H H H H H H H H H H
charge: 0
multiplicity: 1
keywords: wb97x-d3
keywords: def2-TZVPP
keywords: def2/J RIJCOSX
keywords: DEFGRID2
keywords: scfconv7
keywords: smallprint printgap noloewdin
keywords: NOSOSCF
formula: C19H14ClF5N4O2
InChI: InChI=1/C19H14ClF5N4O2/c20-14-7-6-13(8-12(14)9-31-10-18(21,22)19(23,24)25)29-17(11-4-2-1-3-5-11)27-16(28-29)15(26)30/h1-8H,9-10,26H2
45 atoms
Cl 1.822633 -3.467253 1.267488
F  5.012426 0.201885 -0.585523
F  3.754399 1.860619 0.059262
F  2.653139 -0.022481 1.976563
F  4.660038 0.727323 2.188152
F  4.336067 -1.26964 1.465793
O  2.747456 -1.379114 -0.942844
O  -6.813922 -0.566082 0.434201
N  -2.808986 -0.088938 -0.105534
N  -4.032089 -0.516656 0.198864
N  -4.135596 1.458481 -0.842291
N  -6.917076 1.409378 -0.669705
C  -1.684135 -0.888962 0.212357
C  0.43507 -1.854618 -0.413113
C  -0.67686 -1.080966 -0.720509
C  1.557411 -1.988505 -1.406673
C  -2.875099 1.111447 -0.727249
C  -1.613223 -1.483946 1.461289
C  0.487599 -2.454058 0.843734
C  2.66843 0.018259 -0.862799
C  -1.739439 1.914666 -1.181703
C  -0.526323 -2.282421 1.77155
C  3.822805 0.511105 -0.017685
C  -4.795577 0.439755 -0.261794
C  -0.632016 2.141667 -0.366468
C  -1.795492 2.492139 -2.448667
C  3.867609 -0.029747 1.42976
C  0.410286 2.933937 -0.822662
C  -0.748085 3.278867 -2.900694
C  0.356729 3.500013 -2.089684
C  -6.271709 0.377197 -0.128751
H  -0.744196 -0.633321 -1.704009
H  1.801969 -3.036687 -1.581232
H  1.247135 -1.56023 -2.366233
H  -2.394163 -1.333536 2.193544
H  2.740562 0.490849 -1.851952
H  1.734401 0.364756 -0.406987
H  -0.470627 -2.759135 2.740384
H  -0.58638 1.718928 0.628955
H  -2.652661 2.317233 -3.085286
H  1.26449 3.110966 -0.183777
H  -0.796129 3.718671 -3.887942
H  1.173555 4.115371 -2.442899
H  -6.422216 2.166677 -1.112177
H  -7.922567 1.460339 -0.618616
elementType: Cl F O N C H
totalener: -2061.56850329 hartree
nucrepener: 3417.03130042 hartree
electener: -5478.59980371 hartree
oneelecener: -9630.70911147 hartree
twoeener: 4152.10930776 hartree
cpcmener: -0.05542484 hartree
kineticenergy: 2054.88089725 hartree
xcener: -164.588483412849 hartree
chargesum: -0.0000000
charge: -0.077961 -0.190220 -0.187046 -0.164420 -0.162721 -0.157403 -0.352627 -0.531001 0.170553 -0.308676 -0.417793 -0.217004 0.088073 0.018084 -0.157452 0.030252 0.486117 -0.184613 -0.002298 -0.033950 -0.155666 -0.108622 0.365310 0.268319 -0.161412 -0.173177 0.456817 -0.232881 -0.198890 -0.087906 0.258344 0.162335 0.130519 0.111295 0.151022 0.134126 0.097476 0.144052 0.160395 0.145167 0.160804 0.159486 0.164087 0.201615 0.199489
qa: -0.0780 -0.1902 -0.1870 -0.1644 -0.1627 -0.1574 -0.3526 -0.5310 0.1706 -0.3087 -0.4178 -0.2170 0.0881 0.0181 -0.1575 0.0303 0.4861 -0.1846 -0.0023 -0.0339 -0.1557 -0.1086 0.3653 0.2683 -0.1614 -0.1732 0.4568 -0.2329 -0.1989 -0.0879 0.2583 0.1623 0.1305 0.1113 0.1510 0.1341 0.0975 0.1441 0.1604 0.1452 0.1608 0.1595 0.1641 0.2016 0.1995
va: 1.2463 1.1230 1.1167 1.1430 1.1519 1.1575 1.9598 1.9811 3.3990 2.9773 3.0457 3.2351 3.6748 3.5717 3.8978 3.8935 3.6088 4.0487 3.8898 3.9573 3.4828 4.0113 4.2007 3.7504 3.8340 3.9653 4.4355 3.9074 3.9662 3.8442 4.3826 0.9912 0.9926 0.9986 1.0145 1.0098 1.0027 1.0062 1.0024 1.0186 1.0036 0.9932 0.9875 1.0120 1.0002
dispcorr: -0.026663283 hartree
energy: -2061.595166575403
dipole: -32.92234 33.50573 0.58338 12.82225 -10.62399 2.19826 -19.22298 17.07093 -2.15205
magnitude: 3.13113 au
magnitude: 7.95870 debye
