program: Orca
programVersion: 5.0.2
elementType: Cl F F F F F O O N N N N C C C C C C C C C C C C C C C C C C C H H H H H H H H H H H H H H
charge: 0
multiplicity: 1
keywords: wb97x-d3
keywords: def2-TZVPP
keywords: def2/J RIJCOSX
keywords: DEFGRID2
keywords: scfconv7
keywords: smallprint printgap noloewdin
keywords: NOSOSCF
formula: C19H14ClF5N4O2
InChI: InChI=1/C19H14ClF5N4O2/c20-14-7-6-13(8-12(14)9-31-10-18(21,22)19(23,24)25)29-17(11-4-2-1-3-5-11)27-16(28-29)15(26)30/h1-8H,9-10,26H2
45 atoms
Cl 1.380667 -4.418344 -0.085589
F  5.043551 -0.147865 -0.189446
F  3.850434 1.424032 -1.12574
F  4.794629 2.189487 1.209864
F  4.003898 0.470301 2.230892
F  2.666373 1.907823 1.335843
O  2.766441 -1.559563 0.497119
O  -6.768562 -0.168207 0.74396
N  -2.804472 -0.272216 -0.13277
N  -4.063343 -0.543965 0.197874
N  -3.815454 1.641529 -0.213118
N  -6.514137 2.053726 0.381314
C  -1.810761 -1.280721 -0.108874
C  0.375009 -2.004404 0.611355
C  -0.637742 -1.055424 0.593025
C  1.649268 -1.706387 1.354931
C  -2.65953 1.047243 -0.389084
C  -2.01382 -2.470464 -0.785799
C  0.160903 -3.193656 -0.082203
C  2.709373 -0.475968 -0.393159
C  -1.415137 1.68723 -0.81752
C  -1.021742 -3.436716 -0.762609
C  3.852706 0.49384 -0.139205
C  -4.63361 0.632003 0.139221
C  -1.011705 2.868181 -0.199471
C  -0.639017 1.1395 -1.838278
C  3.827754 1.274966 1.187523
C  0.165634 3.487779 -0.589481
C  0.535031 1.765761 -2.22619
C  0.940984 2.937899 -1.601117
C  -6.074953 0.797999 0.448834
H  -0.4998 -0.132818 1.143172
H  1.495844 -0.811031 1.964313
H  1.900301 -2.522221 2.033672
H  -2.928269 -2.649833 -1.334729
H  2.820809 -0.836225 -1.421427
H  1.763089 0.070692 -0.352359
H  -1.171828 -4.370611 -1.286551
H  -1.608767 3.293205 0.596452
H  -0.953084 0.233234 -2.340397
H  0.47856 4.399927 -0.099315
H  1.13188 1.336765 -3.019982
H  1.857423 3.425063 -1.905647
H  -5.900782 2.813167 0.134478
H  -7.479895 2.263208 0.578777
elementType: Cl F O N C H
totalener: -2061.56845226 hartree
nucrepener: 3407.54604768 hartree
electener: -5469.11449995 hartree
oneelecener: -9611.24021735 hartree
twoeener: 4142.12571741 hartree
cpcmener: -0.05596615 hartree
kineticenergy: 2054.88223579 hartree
xcener: -164.587693195868 hartree
chargesum: 0.0000000
charge: -0.075102 -0.189591 -0.188174 -0.161385 -0.160857 -0.160974 -0.371580 -0.531937 0.163842 -0.305974 -0.415330 -0.217495 0.056304 -0.019872 -0.122839 0.045350 0.474246 -0.174434 0.031056 0.021545 -0.156243 -0.122183 0.342335 0.267133 -0.152183 -0.153524 0.459409 -0.216828 -0.224816 -0.086802 0.258015 0.156243 0.109242 0.128152 0.154038 0.138256 0.075767 0.145272 0.146391 0.156059 0.158238 0.158302 0.161169 0.202073 0.199686
qa: -0.0751 -0.1896 -0.1882 -0.1614 -0.1609 -0.1610 -0.3716 -0.5319 0.1638 -0.3060 -0.4153 -0.2175 0.0563 -0.0199 -0.1228 0.0453 0.4742 -0.1744 0.0311 0.0215 -0.1562 -0.1222 0.3423 0.2671 -0.1522 -0.1535 0.4594 -0.2168 -0.2248 -0.0868 0.2580 0.1562 0.1092 0.1282 0.1540 0.1383 0.0758 0.1453 0.1464 0.1561 0.1582 0.1583 0.1612 0.2021 0.1997
va: 1.2520 1.1227 1.1140 1.1555 1.1559 1.1442 1.9381 1.9802 3.4019 2.9797 3.0526 3.2361 3.6947 3.5936 3.8721 3.8584 3.6211 4.0287 3.9283 3.9096 3.5149 4.0042 4.2676 3.7505 3.9389 3.8332 4.4212 3.9381 3.8956 3.7757 4.3826 0.9953 1.0058 0.9946 1.0100 1.0057 1.0159 1.0051 1.0165 1.0006 0.9941 0.9962 0.9925 1.0114 1.0000
dispcorr: -0.027384846 hartree
energy: -2061.595837109420
dipole: -29.85859 30.80268 0.94409 6.55727 -4.77144 1.78583 -8.26138 7.27331 -0.98807
magnitude: 2.24873 au
magnitude: 5.71581 debye
