program: Orca
programVersion: 5.0.2
elementType: Cl F F F F F O O N N N N C C C C C C C C C C C C C C C C C C C H H H H H H H H H H H H H H
charge: 0
multiplicity: 1
keywords: wb97x-d3
keywords: def2-TZVPP
keywords: def2/J RIJCOSX
keywords: DEFGRID2
keywords: scfconv7
keywords: smallprint printgap noloewdin
keywords: NOSOSCF
formula: C19H14ClF5N4O2
InChI: InChI=1/C19H14ClF5N4O2/c20-14-7-6-13(8-12(14)9-31-10-18(21,22)19(23,24)25)29-17(11-4-2-1-3-5-11)27-16(28-29)15(26)30/h1-8H,9-10,26H2
45 atoms
Cl 1.792016 -3.892848 0.642492
F  3.132174 -0.980925 1.496163
F  4.929215 -0.620788 0.325736
F  4.299999 2.103855 0.342348
F  4.628743 1.168386 2.254891
F  2.628406 1.660187 1.63327
O  2.837282 -1.516387 -1.175039
O  -6.749464 1.561318 -0.111899
N  -2.667446 -0.102382 -0.089059
N  -3.878549 -0.470502 0.319329
N  -3.971708 1.551609 -0.62264
N  -6.589432 -0.469156 0.87443
C  -1.573688 -0.985963 0.081485
C  0.49423 -1.940074 -0.716283
C  -0.583166 -1.080257 -0.88438
C  1.606641 -1.945448 -1.728513
C  -2.730827 1.128846 -0.652541
C  -1.517375 -1.772337 1.221753
C  0.521657 -2.74315 0.421443
C  2.854041 -0.189776 -0.714877
C  -1.606719 1.886346 -1.207006
C  -0.473508 -2.666622 1.381268
C  3.673992 -0.168493 0.560276
C  -4.628233 0.545782 -0.019159
C  -0.439418 2.104148 -0.47807
C  -1.734853 2.419551 -2.487653
C  3.811138 1.219358 1.208914
C  0.591781 2.844638 -1.036234
C  -0.69794 3.153494 -3.041877
C  0.466244 3.366283 -2.317141
C  -6.089225 0.592558 0.242476
H  -0.633903 -0.489602 -1.789488
H  1.786654 -2.952242 -2.107297
H  1.32207 -1.321479 -2.581998
H  -2.28091 -1.701897 1.983528
H  3.304343 0.47705 -1.457373
H  1.854524 0.197068 -0.494759
H  -0.436652 -3.295151 2.260128
H  -0.337424 1.706229 0.523827
H  -2.639814 2.247737 -3.055514
H  1.496539 3.018689 -0.470537
H  -0.800618 3.557516 -4.040116
H  1.275717 3.94013 -2.748511
H  -6.011102 -1.246288 1.148784
H  -7.574976 -0.51227 1.081515
elementType: Cl F O N C H
totalener: -2061.56666194 hartree
nucrepener: 3408.07236499 hartree
electener: -5469.63902693 hartree
oneelecener: -9612.34450823 hartree
twoeener: 4142.70548129 hartree
cpcmener: -0.05966269 hartree
kineticenergy: 2054.88424763 hartree
xcener: -164.590734012792 hartree
chargesum: 0.0000000
charge: -0.077617 -0.186175 -0.189289 -0.165344 -0.157760 -0.160738 -0.359245 -0.528955 0.167073 -0.343205 -0.387893 -0.216898 0.108334 0.030904 -0.181397 0.032612 0.496194 -0.182777 -0.000994 -0.012181 -0.192543 -0.116033 0.346222 0.267806 -0.146531 -0.170321 0.456661 -0.217582 -0.205887 -0.092267 0.262309 0.172507 0.126495 0.110800 0.151158 0.145439 0.083396 0.144106 0.159243 0.145692 0.160875 0.159735 0.163735 0.202776 0.197561
qa: -0.0776 -0.1862 -0.1893 -0.1653 -0.1578 -0.1607 -0.3592 -0.5290 0.1671 -0.3432 -0.3879 -0.2169 0.1083 0.0309 -0.1814 0.0326 0.4962 -0.1828 -0.0010 -0.0122 -0.1925 -0.1160 0.3462 0.2678 -0.1465 -0.1703 0.4567 -0.2176 -0.2059 -0.0923 0.2623 0.1725 0.1265 0.1108 0.1512 0.1454 0.0834 0.1441 0.1592 0.1457 0.1609 0.1597 0.1637 0.2028 0.1976
va: 1.2456 1.1143 1.1152 1.1485 1.1621 1.1510 1.9542 1.9833 3.3822 2.8834 3.1028 3.2411 3.7180 3.5832 3.9010 3.8933 3.5973 4.0388 3.8845 3.9713 3.5164 4.0218 4.2163 3.7627 3.8247 3.9670 4.4312 3.9033 3.9665 3.8714 4.3623 0.9804 0.9921 0.9979 1.0152 1.0082 1.0078 1.0062 1.0063 1.0170 1.0049 0.9932 0.9879 1.0062 1.0020
dispcorr: -0.026496810 hartree
energy: -2061.593158751443
dipole: -30.24277 31.24321 1.00044 5.44890 -6.81683 -1.36793 -17.35117 16.82912 -0.52205
magnitude: 1.77332 au
magnitude: 4.50742 debye
