program: Gaussian 09
title: 000055340
version: EM64L-G09RevD.01
frameworkgroup: C1[X(C20H23NO2)]
method: RPBEPBE
basis: SDD
operation: Freq
keyword: #p
keyword: freq=noraman
keyword: PBEPBE/SDD
title: #p freq=noraman PBEPBE/SDD
converged: YES YES NO NO
title: Mulliken charges:
elementType: O O N C C C C C C C C C C C C C C C C C C C C H H H H H H H H H H H H H H H H H H H H H H H
charge: -0.259175 -0.260973 -0.305895 -0.017008 -0.188577 -0.596426 -0.435243 0.480424 0.207741 -0.420485 -0.424894 -0.483725 -0.233768 -0.226835 -0.227148 -0.242285 0.423762 -0.671312 -0.383819 -0.440550 -0.223713 -0.222328 -0.244043 0.279693 0.252217 0.270047 0.215831 0.227504 0.262765 0.248001 0.238829 0.223949 0.199189 0.225201 0.224514 0.224343 0.229200 0.227299 0.233481 0.231690 0.208980 0.267960 0.232354 0.223213 0.223797 0.226217
chargesum: 0.00000
title: Mulliken charges with hydrogens summed into heavy atoms:
elementType: O O N C C C C C C C C C C C C C C C C C C C C
charge: -0.259175 -0.260973 -0.043131 -0.017008 0.091117 -0.074162 0.008092 0.480424 0.207741 -0.172484 -0.186064 -0.060587 -0.008567 -0.002320 0.226395 -0.014987 0.423762 0.002839 -0.115859 -0.208196 -0.000500 0.001469 -0.017826
polarizability: 2.46678180e+02 -8.88707426e+00 2.24233390e+02 1.84676304e+01 2.14502633e+01 1.87436458e+02
1716.lowfreq: -12.1371 -3.8026 -0.0007 -0.0004 -0.0003 6.1713 13.4076 22.9101 25.2073
frequency: 12.3386 22.8246 25.1917 30.2739 39.3532 55.0215 60.7478 74.2239 83.4526 110.7812 133.7260 143.2036 182.1190 200.9399 228.9750 241.0162 252.9102 253.4339 279.5405 318.1758 341.2796 368.1072 404.6769 405.3877 412.0541 433.5593 455.7908 471.8188 507.0682 541.0877 594.3399 615.5583 616.6315 633.2029 685.9816 698.4907 706.0107 709.7363 740.4306 748.4573 774.0147 797.6647 800.9518 814.1304 825.0033 855.7373 858.7580 865.9837 899.0317 912.6108 921.6574 946.5602 964.8744 978.4124 980.8422 989.6951 990.3716 993.1275 996.7478 1000.8568 1014.5104 1024.7202 1025.3636 1036.3009 1071.8692 1077.8451 1080.7260 1089.3338 1102.5650 1112.8091 1132.8103 1134.9034 1140.6000 1160.9081 1169.6453 1171.4494 1180.6794 1186.7292 1202.4310 1214.3950 1248.5355 1253.7710 1278.5964 1287.3082 1303.4991 1315.3663 1326.1700 1356.3726 1360.4068 1375.9817 1386.3910 1402.1264 1408.0581 1433.9715 1439.9522 1445.8490 1448.4098 1462.6298 1473.2448 1474.1515 1482.0570 1486.6485 1487.7518 1489.6009 1589.7506 1593.7784 1599.2824 1614.5552 1615.0453 2868.2314 2917.5152 2967.4082 2996.1151 2996.3605 3007.1654 3066.0846 3092.7371 3099.0561 3108.7384 3113.5730 3118.2828 3120.7158 3122.5366 3123.0894 3133.9258 3136.7354 3144.7359 3150.3458 3161.6099 3162.3107 3207.6316 3423.6491
redmass: 4.6409 5.1554 3.8219 4.0536 3.7995 3.5433 3.0788 4.3501 4.5888 2.8349 2.8325 3.5271 3.4363 3.3057 3.6362 2.2986 2.0483 2.7903 3.2138 3.7894 4.9752 4.7075 2.8592 2.8545 3.7070 2.7085 3.4565 3.6933 3.7348 3.4762 4.4310 6.3660 6.3312 5.2938 1.9194 2.7284 1.7622 1.6903 3.9713 1.5917 2.1138 1.7918 1.6501 3.3515 4.5412 1.2510 1.2487 2.0799 2.0534 1.3898 1.4628 2.0428 1.8985 1.3878 1.3798 5.9658 4.4920 1.5641 1.3237 2.2529 2.0022 2.2845 2.1735 1.9235 1.6681 1.5936 1.6392 2.1669 1.7495 2.2132 4.5473 1.4738 1.6643 1.9156 1.0610 1.0534 1.1132 1.1139 1.3883 2.3729 1.1376 1.3482 2.1086 1.9063 1.5447 1.3416 1.3372 1.5757 1.5675 7.4197 4.9218 1.2667 1.7012 2.2121 2.1124 1.2850 1.2673 1.0398 1.1125 1.1736 1.6725 1.2222 1.9126 1.1809 6.2051 6.1653 9.3811 6.1747 6.1339 1.0704 1.0672 1.0869 1.0466 1.0810 1.0581 1.1067 1.0985 1.0556 1.1023 1.0865 1.0848 1.0886 1.0885 1.0867 1.0920 1.0922 1.0964 1.0952 1.1016 1.1010 1.1162 1.0745
irintensity: 0.1056 0.1805 0.1863 0.2539 0.0813 0.4233 0.5325 3.5160 1.2182 2.1266 1.5366 1.8560 4.3060 2.0468 1.9822 1.8172 0.4527 2.4805 1.9346 0.9312 11.3332 0.9956 0.0496 0.3305 4.3542 3.5240 7.9921 0.2930 2.2011 25.3454 4.5208 0.2081 0.3962 6.1460 54.0291 9.6543 42.5006 69.8607 1.4558 64.8743 28.6340 4.1600 0.7280 12.4817 2.4063 0.3319 0.1159 19.8688 4.1772 10.2529 0.5809 16.4836 6.3957 0.2386 0.0760 0.2750 1.6379 2.1970 0.5559 15.9534 12.4025 23.2279 22.9760 2.4262 57.9204 6.5988 33.0402 15.3385 83.8707 3.5459 99.2840 9.6959 64.2692 113.2350 0.4066 0.0591 2.0642 0.3362 2.2955 5.1444 0.0024 11.3017 102.7848 28.0320 23.8169 1.0727 3.7711 8.2193 1.4730 0.3451 6.2488 18.6118 3.0519 6.7353 10.1946 30.9484 46.3483 12.5119 4.1403 16.5063 16.0704 3.4907 19.3608 12.5439 3.6679 1.4488 146.8597 4.3556 4.7854 79.5165 48.5109 29.8098 40.2777 14.7051 21.5628 10.1828 29.3190 8.7018 38.0636 7.3965 5.1084 4.6010 3.8925 0.9074 14.3858 27.1398 40.5206 30.9486 24.0149 21.7855 5.0626 0.9042
temp: 298.150 k
press: 1.00000 atm
elementType: 8 8 7 6 6 6 6 6 6 6 6 6 6 6 6 6 6 6 6 6 6 6 6 1 1 1 1 1 1 1 1 1 1 1 1 1 1 1 1 1 1 1 1 1 1 1
symmnumber: 1
zpe: 998961.7 jmol-1
zpe.correction: 0.380484 hartree
zpe.thermalcorrener: 0.402799 hartree
zpe.thermalcorrenthalpy: 0.403743 hartree
zpe.thermalcorrgfe: 0.324675 hartree
zpe.sumelectzpe: -979.410609 hartree
zpe.sumelectthermal: -979.388295 hartree
zpe.sumelectthermalent: -979.387351 hartree
zpe.sumelectthermalfe: -979.466418 hartree
dipole: -0.5505 0.2634 1.1867
dipole: 1.3345
quadrupole: -128.7886 -133.4741 -129.4173
quadrupole: -3.1037 2.5139 -1.3143
quadrupole: 1.7714 -2.9141 1.1427 -3.1037 2.5139 -1.3143
hfenergy: -979.7910933 hartree
pointgroup: C01 [X(C20H23N1O2)]
dipole: -0.2034538 0.0163143 -0.4837225 debye
polarizability: 246.8526286|13.5146098|211.6196026|-14.9046311|27.7890441|199.8757964 unknown
InChI: InChI=1S/C20H23NO2/c1-2-23-19(22)20(17-11-7-4-8-12-17)13-18(20)15-21-14-16-9-5-3-6-10-16/h3-12,18,21H,2,13-15H2,1H3
charge 0 multiplicity 1
46 atoms
O  -1.518903 1.5579 -1.005517
O  -1.215646 2.679508 1.011503
N  1.43042 0.035654 1.370233
C  -1.884688 0.313168 1.018571
C  -0.895759 -0.224876 2.117313
C  -2.218047 0.398263 2.528231
C  0.442752 0.432771 2.401652
C  -2.600023 -0.700422 0.156914
C  -1.518478 1.628548 0.386854
C  -1.884862 -1.724235 -0.511861
C  -4.005578 -0.623738 -0.010127
C  2.795719 0.559435 1.595137
C  -2.560165 -2.653079 -1.334464
C  -4.684162 -1.550448 -0.831967
C  -1.167194 2.821569 -1.72601
C  -3.962399 -2.568041 -1.498874
C  3.785779 0.041141 0.557494
C  -1.28272 2.518703 -3.216126
C  3.717557 -1.299748 0.099302
C  4.807867 0.884353 0.054757
C  4.657325 -1.787482 -0.835648
C  5.752837 0.397175 -0.877661
C  5.680584 -0.941732 -1.326067
H  -0.852991 -1.32043 2.126691
H  -3.012362 -0.259043 2.893355
H  -2.190394 1.402106 2.963289
H  0.808135 0.065806 3.382102
H  0.319281 1.536782 2.489415
H  1.093821 0.261021 0.422638
H  -0.797218 -1.788588 -0.38667
H  -4.565737 0.164165 0.508176
H  3.109414 0.222057 2.605706
H  2.83885 1.676618 1.61639
H  -1.995359 -3.439801 -1.847536
H  -5.771357 -1.481137 -0.952458
H  -0.144372 3.118181 -1.429614
H  -1.862781 3.614273 -1.395931
H  -4.487426 -3.288655 -2.136176
H  -2.308352 2.205068 -3.4744
H  -0.58965 1.711863 -3.509229
H  -1.034386 3.422511 -3.802178
H  2.916987 -1.941575 0.482374
H  4.864386 1.926635 0.393775
H  4.594383 -2.826043 -1.181029
H  6.538301 1.061092 -1.256758
H  6.410208 -1.320393 -2.050973
