program: Orca
programVersion: 5.0.2
elementType: Cl F F F F F O O N N N N C C C C C C C C C C C C C C C C C C C H H H H H H H H H H H H H H
charge: 0
multiplicity: 1
keywords: wb97x-d3
keywords: def2-TZVPP
keywords: def2/J RIJCOSX
keywords: DEFGRID2
keywords: scfconv7
keywords: smallprint printgap noloewdin
keywords: NOSOSCF
formula: C19H14ClF5N4O2
InChI: InChI=1/C19H14ClF5N4O2/c20-14-7-6-13(8-12(14)9-31-10-18(21,22)19(23,24)25)29-17(11-4-2-1-3-5-11)27-16(28-29)15(26)30/h1-8H,9-10,26H2
45 atoms
Cl 1.242632 -3.841239 1.336544
F  3.224331 1.594244 0.340366
F  4.1743 -0.004693 1.473353
F  5.291891 1.57416 -1.438715
F  6.253019 -0.011316 -0.339892
F  5.883649 1.886751 0.610182
O  2.14182 -0.858009 -0.098348
O  -7.264722 -0.751102 -0.683069
N  -3.257931 -0.334985 -0.143437
N  -4.507923 -0.772556 -0.262145
N  -4.406746 1.425702 -0.667598
N  -7.154034 1.461376 -1.155821
C  -2.199809 -1.221584 0.170843
C  0.071691 -1.939707 -0.200829
C  -1.014431 -1.145876 -0.54154
C  1.374119 -1.729604 -0.909081
C  -3.201665 0.996345 -0.378021
C  -2.345548 -2.132812 1.203987
C  -0.081441 -2.836987 0.852795
C  3.371974 -0.52633 -0.682821
C  -1.987958 1.811634 -0.303643
C  -1.281959 -2.954621 1.535488
C  4.013794 0.498883 0.226911
C  -5.162216 0.31512 -0.579932
C  -1.132663 1.727589 0.794313
C  -1.681594 2.670754 -1.355704
C  5.39012 0.995983 -0.245124
C  0.030598 2.479324 0.82398
C  -0.516201 3.42202 -1.319688
C  0.344525 3.321845 -0.235187
C  -6.62759 0.287544 -0.810302
H  -0.914997 -0.457978 -1.371163
H  1.90239 -2.674161 -1.077103
H  1.190737 -1.279942 -1.891177
H  -3.269916 -2.202029 1.760772
H  4.027849 -1.400008 -0.779605
H  3.242655 -0.097443 -1.683927
H  -1.387393 -3.666284 2.342337
H  -1.374085 1.080722 1.628039
H  -2.341947 2.738379 -2.210358
H  0.688577 2.410521 1.679576
H  -0.277342 4.079771 -2.144684
H  1.256248 3.903985 -0.213245
H  -6.587073 2.289142 -1.240604
H  -8.144495 1.543767 -1.324073
elementType: Cl F O N C H
totalener: -2061.56958253 hartree
nucrepener: 3299.50154509 hartree
electener: -5361.07112763 hartree
oneelecener: -9396.68389988 hartree
twoeener: 4035.61277225 hartree
cpcmener: -0.05679036 hartree
kineticenergy: 2054.88595540 hartree
xcener: -164.586217315604 hartree
chargesum: 0.0000000
charge: -0.076737 -0.183502 -0.188574 -0.160206 -0.160572 -0.158198 -0.348210 -0.531636 0.162563 -0.306839 -0.415807 -0.218064 0.068289 -0.004484 -0.135353 0.036783 0.477221 -0.167845 0.035222 -0.039408 -0.149646 -0.120573 0.347766 0.267632 -0.165183 -0.183887 0.452471 -0.205364 -0.190853 -0.098405 0.257904 0.157049 0.107195 0.109902 0.153046 0.126318 0.121264 0.145652 0.158994 0.144968 0.155906 0.160388 0.160924 0.201743 0.200143
qa: -0.0767 -0.1835 -0.1886 -0.1602 -0.1606 -0.1582 -0.3482 -0.5316 0.1626 -0.3068 -0.4158 -0.2181 0.0683 -0.0045 -0.1354 0.0368 0.4772 -0.1678 0.0352 -0.0394 -0.1496 -0.1206 0.3478 0.2676 -0.1652 -0.1839 0.4525 -0.2054 -0.1909 -0.0984 0.2579 0.1570 0.1072 0.1099 0.1530 0.1263 0.1213 0.1457 0.1590 0.1450 0.1559 0.1604 0.1609 0.2017 0.2001
va: 1.2487 1.1160 1.1170 1.1572 1.1570 1.1608 1.9364 1.9804 3.4044 2.9785 3.0463 3.2355 3.7089 3.7235 3.9264 3.9040 3.6205 4.0234 3.9281 3.9318 3.5105 3.9964 4.2273 3.7483 3.8690 3.9652 4.4531 3.9000 3.9537 3.8386 4.3823 0.9907 0.9990 0.9965 1.0125 1.0058 1.0049 1.0041 0.9994 1.0174 1.0006 0.9927 0.9913 1.0118 0.9997
dispcorr: -0.023906996 hartree
energy: -2061.593489530977
dipole: -36.08827 38.05083 1.96255 6.14135 -4.78609 1.35527 -8.31645 6.84887 -1.46757
magnitude: 2.80038 au
magnitude: 7.11800 debye
