program: Orca
programVersion: 5.0.2
elementType: Cl F F F F F O O N N N N C C C C C C C C C C C C C C C C C C C H H H H H H H H H H H H H H
charge: 0
multiplicity: 1
keywords: wb97x-d3
keywords: def2-TZVPP
keywords: def2/J RIJCOSX
keywords: DEFGRID2
keywords: scfconv7
keywords: smallprint printgap noloewdin
keywords: NOSOSCF
formula: C19H14ClF5N4O2
InChI: InChI=1/C19H14ClF5N4O2/c20-14-7-6-13(8-12(14)9-31-10-18(21,22)19(23,24)25)29-17(11-4-2-1-3-5-11)27-16(28-29)15(26)30/h1-8H,9-10,26H2
45 atoms
Cl 1.727182 -3.24257 1.508131
F  5.593062 0.449032 -0.741822
F  3.804634 1.680116 -0.554035
F  4.480058 -1.07444 1.478518
F  3.131898 0.592266 1.718941
F  5.257674 0.909709 1.773861
O  2.251693 -0.659739 -0.630418
O  -7.120679 1.301674 -0.847269
N  -3.057622 -0.224952 -0.115081
N  -4.303857 -0.659659 0.031442
N  -4.300657 1.417908 -0.796921
N  -7.064543 -0.768436 0.067733
C  -1.953129 -1.039531 0.229305
C  0.270757 -1.811351 -0.274365
C  -0.881483 -1.132467 -0.64186
C  1.477644 -1.723268 -1.154437
C  -3.060152 1.037164 -0.605507
C  -1.928257 -1.685679 1.45425
C  0.298564 -2.428614 0.973968
C  3.549241 -0.595004 -1.149129
C  -1.859403 1.835275 -0.864673
C  -0.799814 -2.400217 1.818809
C  4.302821 0.437385 -0.341287
C  -5.015864 0.353824 -0.391204
C  -0.820788 1.899781 0.064359
C  -1.749921 2.528932 -2.067575
C  4.288519 0.209394 1.187898
C  0.326674 2.620707 -0.224416
C  -0.603335 3.257876 -2.347389
C  0.439668 3.297815 -1.432119
C  -6.500143 0.339381 -0.412274
H  -0.917885 -0.652291 -1.611367
H  2.047964 -2.657871 -1.158682
H  1.179696 -1.515546 -2.187196
H  -2.76602 -1.622028 2.134945
H  4.068565 -1.557883 -1.079828
H  3.56592 -0.28764 -2.202993
H  -0.770073 -2.900866 2.776674
H  -0.902988 1.391377 1.016309
H  -2.550692 2.48634 -2.79429
H  1.130417 2.656399 0.498865
H  -0.523426 3.787822 -3.287253
H  1.337303 3.85811 -1.658598
H  -6.517084 -1.539063 0.414825
H  -8.068276 -0.859565 0.085611
elementType: Cl F O N C H
totalener: -2061.56715466 hartree
nucrepener: 3380.09824199 hartree
electener: -5441.66539665 hartree
oneelecener: -9558.02439068 hartree
twoeener: 4116.35899403 hartree
cpcmener: -0.05802855 hartree
kineticenergy: 2054.90378935 hartree
xcener: -164.589524400088 hartree
chargesum: 0.0000000
charge: -0.078600 -0.185829 -0.189193 -0.161295 -0.160988 -0.162289 -0.348480 -0.529969 0.171476 -0.346788 -0.389195 -0.216397 0.073152 0.012632 -0.158456 0.036021 0.465069 -0.174740 0.022195 -0.036644 -0.141762 -0.105473 0.346640 0.269610 -0.162522 -0.183540 0.459565 -0.213268 -0.194943 -0.093856 0.263504 0.158143 0.109628 0.112113 0.154013 0.123135 0.127687 0.146139 0.159555 0.145093 0.157109 0.159912 0.162408 0.202217 0.197213
qa: -0.0786 -0.1858 -0.1892 -0.1613 -0.1610 -0.1623 -0.3485 -0.5300 0.1715 -0.3468 -0.3892 -0.2164 0.0732 0.0126 -0.1585 0.0360 0.4651 -0.1747 0.0222 -0.0366 -0.1418 -0.1055 0.3466 0.2696 -0.1625 -0.1835 0.4596 -0.2133 -0.1949 -0.0939 0.2635 0.1581 0.1096 0.1121 0.1540 0.1231 0.1277 0.1461 0.1596 0.1451 0.1571 0.1599 0.1624 0.2022 0.1972
va: 1.2467 1.1221 1.1135 1.1541 1.1484 1.1517 1.9377 1.9818 3.3676 2.8800 3.1100 3.2404 3.7076 3.7114 3.9598 3.9004 3.6528 4.0292 3.9340 3.9200 3.4959 3.9863 4.1940 3.7578 3.8657 3.9710 4.4301 3.8919 3.9597 3.8503 4.3608 0.9929 1.0000 0.9982 1.0110 1.0081 1.0036 1.0035 0.9991 1.0187 1.0038 0.9931 0.9891 1.0070 1.0020
dispcorr: -0.025299245 hartree
energy: -2061.592453909971
dipole: -32.39355 34.28603 1.89248 2.52292 -5.55120 -3.02829 -14.02663 13.75137 -0.27526
magnitude: 3.58159 au
magnitude: 9.10368 debye
