program: Orca
programVersion: 5.0.2
elementType: Cl F F F F F O O N N N N C C C C C C C C C C C C C C C C C C C H H H H H H H H H H H H H H
charge: 0
multiplicity: 1
keywords: wb97x-d3
keywords: def2-TZVPP
keywords: def2/J RIJCOSX
keywords: DEFGRID2
keywords: scfconv7
keywords: smallprint printgap noloewdin
keywords: NOSOSCF
formula: C19H14ClF5N4O2
InChI: InChI=1/C19H14ClF5N4O2/c20-14-7-6-13(8-12(14)9-31-10-18(21,22)19(23,24)25)29-17(11-4-2-1-3-5-11)27-16(28-29)15(26)30/h1-8H,9-10,26H2
45 atoms
Cl 1.166994 -4.813868 -0.845128
F  4.987769 0.918657 0.403886
F  3.163344 0.472881 -0.717478
F  1.692648 1.727033 1.236697
F  3.24334 2.95036 0.378815
F  3.497554 2.114138 2.348036
O  2.191798 -1.101051 1.282792
O  -6.242944 0.029549 1.614013
N  -2.543189 -0.321283 -0.020789
N  -3.726535 -0.51069 0.556328
N  -3.462754 1.639934 0.007666
N  -6.002436 2.205585 1.028823
C  -1.651425 -1.411084 -0.18552
C  0.551136 -2.344223 0.070675
C  -0.344149 -1.300361 0.262069
C  1.987104 -2.254633 0.500933
C  -2.389038 0.979421 -0.360691
C  -2.108966 -2.564277 -0.798362
C  0.081257 -3.494187 -0.560824
C  3.517847 -0.651592 1.332963
C  -1.234066 1.560957 -1.043571
C  -1.231514 -3.617962 -0.981985
C  3.670364 0.629949 0.527374
C  -4.242664 0.691039 0.555753
C  -0.808135 2.833601 -0.667817
C  -0.57522 0.891665 -2.074862
C  3.008105 1.878997 1.132179
C  0.275081 3.42129 -1.301331
C  0.510379 1.482559 -2.701153
C  0.941859 2.744093 -2.312911
C  -5.592016 0.941674 1.117819
H  -0.024549 -0.394468 0.756551
H  2.260192 -3.147664 1.074687
H  2.621337 -2.248929 -0.392831
H  -3.130805 -2.644217 -1.142375
H  3.807212 -0.474539 2.371489
H  4.225532 -1.381249 0.925897
H  -1.569818 -4.524467 -1.464265
H  -1.316519 3.360256 0.128697
H  -0.913905 -0.080529 -2.407452
H  0.601191 4.40751 -0.999404
H  1.015645 0.957116 -3.500337
H  1.791222 3.200755 -2.803477
H  -5.42784 2.916639 0.606705
H  -6.908813 2.470107 1.381778
elementType: Cl F O N C H
totalener: -2061.56858113 hartree
nucrepener: 3427.59475042 hartree
electener: -5489.16333155 hartree
oneelecener: -9653.13660554 hartree
twoeener: 4163.97327399 hartree
cpcmener: -0.05236112 hartree
kineticenergy: 2054.88546411 hartree
xcener: -164.591352740186 hartree
chargesum: -0.0000000
charge: -0.080137 -0.187366 -0.187443 -0.156259 -0.164862 -0.163183 -0.367314 -0.532803 0.172574 -0.309152 -0.419288 -0.217606 0.027148 0.125762 -0.175396 0.014921 0.481359 -0.192166 -0.000751 -0.006048 -0.126440 -0.109803 0.332171 0.265324 -0.184867 -0.187631 0.472229 -0.202114 -0.178727 -0.114896 0.261257 0.162266 0.113136 0.113576 0.151332 0.130448 0.116215 0.144407 0.140516 0.161254 0.156240 0.158008 0.162098 0.202059 0.199948
qa: -0.0801 -0.1874 -0.1874 -0.1563 -0.1649 -0.1632 -0.3673 -0.5328 0.1726 -0.3092 -0.4193 -0.2176 0.0271 0.1258 -0.1754 0.0149 0.4814 -0.1922 -0.0008 -0.0060 -0.1264 -0.1098 0.3322 0.2653 -0.1849 -0.1876 0.4722 -0.2021 -0.1787 -0.1149 0.2613 0.1623 0.1131 0.1136 0.1513 0.1304 0.1162 0.1444 0.1405 0.1613 0.1562 0.1580 0.1621 0.2021 0.1999
va: 1.2513 1.1217 1.1106 1.1493 1.1461 1.1568 1.9696 1.9788 3.3992 2.9746 3.0512 3.2366 3.7713 3.5071 3.9504 3.9423 3.6117 4.0520 3.9802 3.9167 3.4665 3.9938 4.1974 3.7572 3.9412 3.8774 4.3896 3.9142 3.8775 3.8317 4.3797 1.0192 0.9913 0.9847 1.0120 1.0049 1.0031 1.0046 1.0227 0.9979 0.9956 0.9935 0.9876 1.0114 0.9999
dispcorr: -0.026039355 hartree
energy: -2061.594620486132
dipole: -19.87440 22.71581 2.84141 0.87615 -0.26036 0.61579 -7.51471 6.26636 -1.24836
magnitude: 3.16405 au
magnitude: 8.04237 debye
