program: Orca
programVersion: 5.0.2
elementType: Cl F F F F F O O N N N N C C C C C C C C C C C C C C C C C C C H H H H H H H H H H H H H H
charge: 0
multiplicity: 1
keywords: wb97x-d3
keywords: def2-TZVPP
keywords: def2/J RIJCOSX
keywords: DEFGRID2
keywords: scfconv7
keywords: smallprint printgap noloewdin
keywords: NOSOSCF
formula: C19H14ClF5N4O2
InChI: InChI=1/C19H14ClF5N4O2/c20-14-7-6-13(8-12(14)9-31-10-18(21,22)19(23,24)25)29-17(11-4-2-1-3-5-11)27-16(28-29)15(26)30/h1-8H,9-10,26H2
45 atoms
Cl 1.232596 -4.752651 -0.077201
F  4.347888 1.286495 1.298354
F  5.808127 1.206581 -0.319913
F  2.453596 2.168119 -0.314328
F  3.617215 1.757433 -2.08317
F  4.266065 3.261232 -0.685266
O  2.806812 -0.633496 -0.026106
O  -1.79693 3.384345 -2.763305
N  -2.030585 0.138289 -0.33675
N  -1.711721 1.055187 -1.245854
N  -3.524639 1.690022 -0.104325
N  -3.647074 4.035847 -1.629775
C  -1.261984 -1.048269 -0.243273
C  0.916674 -2.068183 -0.160337
C  0.118577 -0.934182 -0.209482
C  2.415167 -1.975937 -0.175209
C  -3.123638 0.528661 0.358669
C  -1.882763 -2.285199 -0.22493
C  0.280447 -3.307279 -0.129044
C  4.163632 -0.43771 -0.305531
C  -3.745496 -0.204496 1.461098
C  -1.099021 -3.423954 -0.155776
C  4.50534 1.007951 -0.016517
C  -2.633213 1.966519 -1.074322
C  -2.98094 -0.801031 2.463095
C  -5.13609 -0.274757 1.519898
C  3.690386 2.06664 -0.790705
C  -3.605648 -1.468348 3.504919
C  -5.754562 -0.945978 2.562933
C  -4.991336 -1.545965 3.555184
C  -2.650515 3.196011 -1.904235
H  0.568796 0.0476 -0.228729
H  2.846587 -2.589073 0.625338
H  2.788202 -2.384246 -1.124273
H  -2.959204 -2.373116 -0.277129
H  4.810035 -1.062085 0.325164
H  4.404056 -0.669368 -1.349571
H  -1.565739 -4.398963 -0.142725
H  -1.9009 -0.731638 2.446921
H  -5.733204 0.18584 0.744051
H  -3.007616 -1.924167 4.282609
H  -6.834318 -1.001944 2.598615
H  -5.475284 -2.069747 4.368917
H  -4.323527 3.834325 -0.911763
H  -3.733177 4.898271 -2.144266
elementType: Cl F O N C H
totalener: -2061.57012113 hartree
nucrepener: 3272.45343938 hartree
electener: -5334.02356051 hartree
oneelecener: -9343.70842081 hartree
twoeener: 4009.68486030 hartree
cpcmener: -0.05457528 hartree
kineticenergy: 2054.87391255 hartree
xcener: -164.587844878631 hartree
chargesum: 0.0000000
charge: -0.079381 -0.188003 -0.185782 -0.156393 -0.163216 -0.160091 -0.353636 -0.532154 0.174845 -0.306996 -0.420024 -0.216748 0.013696 0.060421 -0.136895 0.022505 0.488652 -0.178774 0.029290 -0.020110 -0.160167 -0.112172 0.332507 0.266287 -0.196795 -0.174718 0.460540 -0.169389 -0.193342 -0.112259 0.258196 0.148529 0.106906 0.110094 0.166395 0.120795 0.121676 0.144079 0.160802 0.144699 0.160932 0.159914 0.163292 0.202278 0.199716
qa: -0.0794 -0.1880 -0.1858 -0.1564 -0.1632 -0.1601 -0.3536 -0.5322 0.1748 -0.3070 -0.4200 -0.2167 0.0137 0.0604 -0.1369 0.0225 0.4887 -0.1788 0.0293 -0.0201 -0.1602 -0.1122 0.3325 0.2663 -0.1968 -0.1747 0.4605 -0.1694 -0.1933 -0.1123 0.2582 0.1485 0.1069 0.1101 0.1664 0.1208 0.1217 0.1441 0.1608 0.1447 0.1609 0.1599 0.1633 0.2023 0.1997
va: 1.2513 1.1224 1.1209 1.1526 1.1530 1.1546 1.9754 1.9801 3.3963 2.9733 3.0496 3.2364 3.7735 3.6264 4.0054 3.9464 3.6004 3.9737 3.9638 3.9155 3.5000 3.9914 4.2537 3.7532 3.8945 3.9679 4.4254 3.9145 3.9524 3.8703 4.3826 1.0297 0.9913 0.9836 0.9889 1.0009 1.0059 1.0054 0.9981 1.0199 0.9929 0.9936 0.9881 1.0112 1.0001
dispcorr: -0.022205249 hartree
energy: -2061.592326378048
dipole: -39.59744 38.00571 -1.59173 -12.15402 9.43494 -2.71908 10.69945 -8.68362 2.01583
magnitude: 3.74040 au
magnitude: 9.50733 debye
