program: Orca
programVersion: 5.0.2
elementType: Cl F F F F F O O N N N N C C C C C C C C C C C C C C C C C C C H H H H H H H H H H H H H H
charge: 0
multiplicity: 1
keywords: wb97x-d3
keywords: def2-TZVPP
keywords: def2/J RIJCOSX
keywords: DEFGRID2
keywords: scfconv7
keywords: smallprint printgap noloewdin
keywords: NOSOSCF
formula: C19H14ClF5N4O2
InChI: InChI=1/C19H14ClF5N4O2/c20-14-7-6-13(8-12(14)9-31-10-18(21,22)19(23,24)25)29-17(11-4-2-1-3-5-11)27-16(28-29)15(26)30/h1-8H,9-10,26H2
45 atoms
Cl 1.810717 -3.462411 1.300314
F  3.3838 1.793904 0.376352
F  2.130515 0.241876 1.261302
F  5.484833 -0.071012 0.33143
F  4.252059 -1.387573 1.513169
F  4.724074 0.579388 2.237599
O  2.833978 -1.465255 -0.965955
O  -6.747992 -0.454217 0.352418
N  -2.731364 0.000312 -0.154754
N  -3.958011 -0.410703 0.160271
N  -4.050663 1.521745 -0.956492
N  -6.826656 1.510907 -0.772284
C  -1.615293 -0.801745 0.189308
C  0.490655 -1.818194 -0.401594
C  -0.599659 -1.023219 -0.729084
C  1.60185 -2.012893 -1.396517
C  -2.791978 1.175749 -0.824659
C  -1.568934 -1.382885 1.445768
C  0.512569 -2.411371 0.859023
C  2.910907 -0.064782 -0.957334
C  -1.658412 1.95959 -1.314817
C  -0.503979 -2.20301 1.775407
C  3.1881 0.453699 0.443901
C  -4.716836 0.528574 -0.340114
C  -0.535858 2.203048 -0.52556
C  -1.737178 2.506564 -2.594272
C  4.432252 -0.12626 1.146825
C  0.495397 2.98649 -1.019808
C  -0.697718 3.279841 -3.085815
C  0.420148 3.520786 -2.299422
C  -6.193999 0.47811 -0.217308
H  -0.65072 -0.589645 -1.719725
H  1.789135 -3.075027 -1.559958
H  1.303464 -1.585717 -2.359113
H  -2.356401 -1.208385 2.165596
H  3.713815 0.268192 -1.621126
H  1.990803 0.420392 -1.303449
H  -0.469915 -2.672957 2.748499
H  -0.470261 1.803243 0.47822
H  -2.607407 2.317574 -3.208767
H  1.358576 3.184431 -0.401245
H  -0.762584 3.694114 -4.083026
H  1.231358 4.126629 -2.681013
H  -6.321416 2.25886 -1.218588
H  -7.832218 1.56672 -0.731621
elementType: Cl F O N C H
totalener: -2061.56663568 hartree
nucrepener: 3430.84809791 hartree
electener: -5492.41473359 hartree
oneelecener: -9658.88584710 hartree
twoeener: 4166.47111352 hartree
cpcmener: -0.05408060 hartree
kineticenergy: 2054.89425956 hartree
xcener: -164.590512230393 hartree
chargesum: 0.0000000
charge: -0.076662 -0.193505 -0.192395 -0.164651 -0.152271 -0.162664 -0.359712 -0.531134 0.169220 -0.308086 -0.418639 -0.217108 0.068420 -0.004460 -0.135901 0.024167 0.490924 -0.183893 0.029752 -0.042996 -0.162062 -0.117910 0.339738 0.268717 -0.166220 -0.169669 0.470575 -0.235290 -0.203856 -0.083566 0.258639 0.165523 0.124620 0.112922 0.150659 0.146184 0.127941 0.143240 0.157313 0.144195 0.165513 0.159065 0.164227 0.201691 0.199403
qa: -0.0767 -0.1935 -0.1924 -0.1647 -0.1523 -0.1627 -0.3597 -0.5311 0.1692 -0.3081 -0.4186 -0.2171 0.0684 -0.0045 -0.1359 0.0242 0.4909 -0.1839 0.0298 -0.0430 -0.1621 -0.1179 0.3397 0.2687 -0.1662 -0.1697 0.4706 -0.2353 -0.2039 -0.0836 0.2586 0.1655 0.1246 0.1129 0.1507 0.1462 0.1279 0.1432 0.1573 0.1442 0.1655 0.1591 0.1642 0.2017 0.1994
va: 1.2493 1.1113 1.1010 1.1504 1.1615 1.1506 1.9569 1.9809 3.4012 2.9794 3.0437 3.2348 3.7019 3.5645 3.8871 3.8928 3.6001 4.0512 3.8744 3.9841 3.4893 4.0267 4.0983 3.7497 3.8440 3.9647 4.4699 3.9051 3.9712 3.8477 4.3827 0.9872 0.9931 0.9983 1.0151 1.0058 0.9904 1.0067 1.0083 1.0198 1.0065 0.9936 0.9872 1.0123 1.0003
dispcorr: -0.026922690 hartree
energy: -2061.593558369821
dipole: -30.89637 32.13539 1.23902 13.37525 -11.18433 2.19092 -21.39631 18.80441 -2.59191
magnitude: 3.61293 au
magnitude: 9.18334 debye
