program: Orca
programVersion: 5.0.2
elementType: Cl F F F F F O O N N N N C C C C C C C C C C C C C C C C C C C H H H H H H H H H H H H H H
charge: 0
multiplicity: 1
keywords: wb97x-d3
keywords: def2-TZVPP
keywords: def2/J RIJCOSX
keywords: DEFGRID2
keywords: scfconv7
keywords: smallprint printgap noloewdin
keywords: NOSOSCF
formula: C19H14ClF5N4O2
InChI: InChI=1/C19H14ClF5N4O2/c20-14-7-6-13(8-12(14)9-31-10-18(21,22)19(23,24)25)29-17(11-4-2-1-3-5-11)27-16(28-29)15(26)30/h1-8H,9-10,26H2
45 atoms
Cl 1.079395 -4.988292 0.535305
F  3.909102 1.508626 0.735505
F  4.829811 0.339411 -0.854638
F  3.608219 2.851355 -1.449624
F  1.713601 1.874913 -1.148679
F  3.090798 1.130668 -2.629545
O  2.376311 -1.102314 -1.086021
O  -6.305302 0.066156 -1.23173
N  -2.490365 -0.32206 0.129335
N  -3.714708 -0.501965 -0.361833
N  -3.390061 1.648242 0.147468
N  -5.980551 2.244151 -0.697406
C  -1.609643 -1.428736 0.230779
C  0.525472 -2.445614 -0.226474
C  -0.343446 -1.364572 -0.327737
C  1.900088 -2.403623 -0.849012
C  -2.29967 0.980343 0.446097
C  -2.052049 -2.571639 0.876575
C  0.062478 -3.590467 0.417259
C  2.795487 -0.430432 0.073411
C  -1.105779 1.564717 1.054938
C  -1.209655 -3.663655 0.961312
C  3.641789 0.750502 -0.352388
C  -4.217612 0.70463 -0.335909
C  -0.725296 2.849301 0.669277
C  -0.380167 0.900247 2.043525
C  3.00087 1.667219 -1.418523
C  0.375667 3.455103 1.252065
C  0.721136 1.511972 2.622186
C  1.105688 2.78544 2.224115
C  -5.600814 0.971418 -0.800437
H  -0.032418 -0.470118 -0.852208
H  2.61249 -2.956547 -0.227761
H  1.870073 -2.902298 -1.820753
H  -3.040837 -2.613782 1.311973
H  1.957805 -0.070268 0.679734
H  3.413447 -1.071593 0.715552
H  -1.542164 -4.564976 1.457123
H  -1.287171 3.371218 -0.093831
H  -0.679462 -0.082369 2.383585
H  0.667441 4.4491 0.940232
H  1.278201 0.991851 3.389846
H  1.967414 3.257365 2.677056
H  -5.360511 2.949381 -0.334031
H  -6.906251 2.518344 -0.987018
elementType: Cl F O N C H
totalener: -2061.56917750 hartree
nucrepener: 3428.90116156 hartree
electener: -5490.47033905 hartree
oneelecener: -9654.57251597 hartree
twoeener: 4164.10217692 hartree
cpcmener: -0.05273110 hartree
kineticenergy: 2054.87242574 hartree
xcener: -164.589563282615 hartree
chargesum: 0.0000000
charge: -0.080250 -0.187571 -0.188989 -0.164633 -0.153036 -0.159377 -0.368769 -0.532587 0.174384 -0.309477 -0.419110 -0.217315 0.067062 0.121437 -0.217705 0.005384 0.468057 -0.209605 -0.011262 -0.008703 -0.109643 -0.095813 0.352995 0.265475 -0.193861 -0.182286 0.461839 -0.183708 -0.183058 -0.116221 0.261565 0.159866 0.112779 0.132481 0.150836 0.099107 0.136962 0.144607 0.139982 0.160634 0.155516 0.159052 0.161396 0.201862 0.199702
qa: -0.0802 -0.1876 -0.1890 -0.1646 -0.1530 -0.1594 -0.3688 -0.5326 0.1744 -0.3095 -0.4191 -0.2173 0.0671 0.1214 -0.2177 0.0054 0.4681 -0.2096 -0.0113 -0.0087 -0.1096 -0.0958 0.3530 0.2655 -0.1939 -0.1823 0.4618 -0.1837 -0.1831 -0.1162 0.2616 0.1599 0.1128 0.1325 0.1508 0.0991 0.1370 0.1446 0.1400 0.1606 0.1555 0.1591 0.1614 0.2019 0.1997
va: 1.2498 1.1132 1.1226 1.1497 1.1487 1.1577 1.9623 1.9793 3.4008 2.9776 3.0516 3.2359 3.7112 3.4911 3.9669 3.9358 3.6351 4.0643 3.9717 3.8692 3.4675 3.9722 4.2305 3.7580 3.9617 3.8331 4.4104 3.9072 3.8611 3.8179 4.3806 1.0149 0.9995 0.9871 1.0127 1.0187 1.0138 1.0047 1.0234 0.9988 0.9944 0.9953 0.9881 1.0118 1.0001
dispcorr: -0.026961983 hartree
energy: -2061.596139480025
dipole: -22.45402 24.30256 1.84854 2.16377 -1.44186 0.72191 13.15495 -10.99113 2.16382
magnitude: 2.93605 au
magnitude: 7.46283 debye
