program: Orca
programVersion: 5.0.2
elementType: Cl F F F F F O O N N N N C C C C C C C C C C C C C C C C C C C H H H H H H H H H H H H H H
charge: 0
multiplicity: 1
keywords: wb97x-d3
keywords: def2-TZVPP
keywords: def2/J RIJCOSX
keywords: DEFGRID2
keywords: scfconv7
keywords: smallprint printgap noloewdin
keywords: NOSOSCF
formula: C19H14ClF5N4O2
InChI: InChI=1/C19H14ClF5N4O2/c20-14-7-6-13(8-12(14)9-31-10-18(21,22)19(23,24)25)29-17(11-4-2-1-3-5-11)27-16(28-29)15(26)30/h1-8H,9-10,26H2
45 atoms
Cl 1.301902 -4.377333 1.798333
F  1.781315 1.115594 -1.36265
F  2.398383 0.132731 0.477371
F  4.409079 1.780283 -1.857984
F  5.006193 0.769817 -0.047507
F  3.673619 2.456812 0.047289
O  1.940333 -1.663499 -1.631078
O  -6.122021 1.646373 -1.608557
N  -2.542269 -0.255213 0.10989
N  -3.744826 -0.640033 -0.309694
N  -3.517052 1.570692 -0.536973
N  -6.316872 -0.592503 -1.337893
C  -1.597469 -1.226407 0.534008
C  0.502389 -2.351785 0.195325
C  -0.425605 -1.391409 -0.186096
C  1.770042 -2.593013 -0.582381
C  -2.410998 1.083318 -0.023396
C  -1.882346 -2.006411 1.640688
C  0.195646 -3.139525 1.302278
C  3.077046 -0.845978 -1.570761
C  -1.249734 1.879015 0.369953
C  -0.97345 -2.975164 2.025927
C  2.792683 0.424902 -0.78564
C  -4.292958 0.485451 -0.690849
C  -0.51131 1.590412 1.516501
C  -0.920429 2.997248 -0.395442
C  3.993841 1.37907 -0.660369
C  0.542828 2.410884 1.886703
C  0.133096 3.813848 -0.01954
C  0.866156 3.52356 1.123182
C  -5.664259 0.566606 -1.25415
H  -0.24698 -0.775134 -1.056335
H  2.629228 -2.592923 0.095519
H  1.725686 -3.594556 -1.023279
H  -2.795704 -1.863377 2.201678
H  3.935198 -1.367336 -1.13548
H  3.34381 -0.574167 -2.593631
H  -1.175868 -3.597576 2.886248
H  -0.765962 0.745075 2.141981
H  -1.487576 3.226767 -1.287472
H  1.105657 2.184216 2.78195
H  0.380938 4.678252 -0.620969
H  1.68292 4.167413 1.42121
H  -5.901324 -1.459279 -1.038572
H  -7.249436 -0.618451 -1.719471
elementType: Cl F O N C H
totalener: -2061.56817365 hartree
nucrepener: 3446.56988471 hartree
electener: -5508.13805836 hartree
oneelecener: -9691.14039750 hartree
twoeener: 4183.00233914 hartree
cpcmener: -0.05581277 hartree
kineticenergy: 2054.88395170 hartree
xcener: -164.590027838878 hartree
chargesum: 0.0000000
charge: -0.079592 -0.199859 -0.203690 -0.161465 -0.161492 -0.155160 -0.377533 -0.530206 0.188256 -0.342980 -0.390759 -0.216674 0.000382 0.092615 -0.140725 0.021466 0.464171 -0.207054 0.006810 -0.009251 -0.107679 -0.091600 0.359539 0.267218 -0.197849 -0.185576 0.466444 -0.190867 -0.184199 -0.113892 0.263113 0.141819 0.115117 0.129675 0.153044 0.126864 0.137601 0.144006 0.158951 0.139738 0.156126 0.157672 0.158880 0.201167 0.197431
qa: -0.0796 -0.1999 -0.2037 -0.1615 -0.1615 -0.1552 -0.3775 -0.5302 0.1883 -0.3430 -0.3908 -0.2167 0.0004 0.0926 -0.1407 0.0215 0.4642 -0.2071 0.0068 -0.0093 -0.1077 -0.0916 0.3595 0.2672 -0.1978 -0.1856 0.4664 -0.1909 -0.1842 -0.1139 0.2631 0.1418 0.1151 0.1297 0.1530 0.1269 0.1376 0.1440 0.1590 0.1397 0.1561 0.1577 0.1589 0.2012 0.1974
va: 1.2528 1.1045 1.0947 1.1571 1.1574 1.1517 1.9780 1.9819 3.3500 2.8819 3.1161 3.2393 3.7423 3.5083 3.9391 3.9171 3.6386 4.0503 3.9579 3.9930 3.4500 3.9620 4.0188 3.7662 3.8717 3.9732 4.4888 3.8897 3.9411 3.8160 4.3635 1.0432 0.9938 0.9898 1.0087 1.0028 1.0058 1.0045 0.9984 1.0260 0.9953 0.9941 0.9909 1.0079 1.0021
dispcorr: -0.026760829 hartree
energy: -2061.594934483032
dipole: -22.48097 25.23587 2.75490 -1.37575 -1.68377 -3.05952 1.29238 -0.31462 0.97776
magnitude: 4.23157 au
magnitude: 10.75578 debye
