program: Orca
programVersion: 5.0.2
elementType: Cl F F F F F O O N N N N C C C C C C C C C C C C C C C C C C C H H H H H H H H H H H H H H
charge: 0
multiplicity: 1
keywords: wb97x-d3
keywords: def2-TZVPP
keywords: def2/J RIJCOSX
keywords: DEFGRID2
keywords: scfconv7
keywords: smallprint printgap noloewdin
keywords: NOSOSCF
formula: C19H14ClF5N4O2
InChI: InChI=1/C19H14ClF5N4O2/c20-14-7-6-13(8-12(14)9-31-10-18(21,22)19(23,24)25)29-17(11-4-2-1-3-5-11)27-16(28-29)15(26)30/h1-8H,9-10,26H2
45 atoms
Cl 0.873922 -4.909335 -0.103099
F  3.421019 1.204399 -0.756987
F  2.626169 1.843075 1.163939
F  5.876407 0.837029 0.356271
F  5.121417 1.422202 2.289179
F  5.073428 2.81413 0.647842
O  1.950925 -0.696929 0.552621
O  -6.918138 -0.238714 0.614947
N  -2.939861 -0.41715 -0.208797
N  -4.2069 -0.657996 0.120869
N  -3.926282 1.510197 -0.334724
N  -6.62591 1.972649 0.216743
C  -2.001678 -1.47886 -0.196914
C  0.224263 -2.298528 0.232887
C  -0.701658 -1.262279 0.234144
C  1.647684 -2.068204 0.654617
C  -2.777316 0.897883 -0.493433
C  -2.416398 -2.738194 -0.601522
C  -0.215798 -3.563739 -0.148003
C  3.266049 -0.417653 0.947799
C  -1.53758 1.548668 -0.920341
C  -1.518992 -3.788433 -0.558983
C  3.533126 1.026446 0.580145
C  -4.761827 0.521615 0.033776
C  -0.764744 1.037792 -1.961587
C  -1.14715 2.720724 -0.277097
C  4.929901 1.535402 0.978053
C  0.396881 1.690913 -2.341618
C  0.016043 3.369319 -0.662059
C  0.789298 2.855404 -1.693403
C  -6.205508 0.712734 0.31767
H  -0.402415 -0.284826 0.583248
H  1.793314 -2.424556 1.683291
H  2.325229 -2.649709 0.018436
H  -3.427744 -2.908199 -0.942211
H  3.405054 -0.562288 2.025696
H  3.989679 -1.060517 0.432495
H  -1.835906 -4.777982 -0.857532
H  -1.07095 0.137989 -2.479761
H  -1.74529 3.116421 0.533184
H  0.99396 1.293112 -3.151153
H  0.31757 4.275602 -0.154009
H  1.695309 3.363748 -1.994971
H  -5.997545 2.718013 -0.035214
H  -7.593727 2.19673 0.386785
elementType: Cl F O N C H
totalener: -2061.56886191 hartree
nucrepener: 3319.70422110 hartree
electener: -5381.27308301 hartree
oneelecener: -9437.28622797 hartree
twoeener: 4056.01314496 hartree
cpcmener: -0.05302798 hartree
kineticenergy: 2054.87225902 hartree
xcener: -164.588857829477 hartree
chargesum: -0.0000000
charge: -0.081022 -0.193866 -0.195660 -0.160252 -0.160425 -0.157609 -0.346051 -0.531428 0.164505 -0.308210 -0.416161 -0.217159 0.069785 0.102003 -0.187369 0.020265 0.495349 -0.183555 0.011587 -0.039808 -0.196485 -0.122961 0.369000 0.268647 -0.151455 -0.151464 0.462184 -0.200964 -0.215946 -0.106242 0.258980 0.158848 0.118180 0.100681 0.149510 0.123647 0.120964 0.143184 0.160450 0.146470 0.158621 0.158355 0.161113 0.202067 0.199699
qa: -0.0810 -0.1939 -0.1957 -0.1603 -0.1604 -0.1576 -0.3461 -0.5314 0.1645 -0.3082 -0.4162 -0.2172 0.0698 0.1020 -0.1874 0.0203 0.4953 -0.1836 0.0116 -0.0398 -0.1965 -0.1230 0.3690 0.2686 -0.1515 -0.1515 0.4622 -0.2010 -0.2159 -0.1062 0.2590 0.1588 0.1182 0.1007 0.1495 0.1236 0.1210 0.1432 0.1604 0.1465 0.1586 0.1584 0.1611 0.2021 0.1997
va: 1.2490 1.1126 1.1083 1.1571 1.1573 1.1614 1.9671 1.9805 3.4093 2.9743 3.0428 3.2357 3.7782 3.5792 3.9370 3.9274 3.5851 4.0375 3.9625 3.9533 3.5250 4.0155 4.1656 3.7486 3.8547 3.9472 4.4718 3.9190 3.9348 3.8050 4.3821 1.0136 0.9831 0.9958 1.0187 1.0057 1.0024 1.0058 0.9997 1.0165 0.9947 0.9945 0.9916 1.0116 1.0001
dispcorr: -0.024159621 hartree
energy: -2061.593021528866
dipole: -29.00445 31.78523 2.78078 1.26855 -0.71875 0.54980 -7.10461 6.79112 -0.31348
magnitude: 2.85189 au
magnitude: 7.24893 debye
