program: Orca
programVersion: 5.0.2
elementType: Cl F F F F F O O N N N N C C C C C C C C C C C C C C C C C C C H H H H H H H H H H H H H H
charge: 0
multiplicity: 1
keywords: wb97x-d3
keywords: def2-TZVPP
keywords: def2/J RIJCOSX
keywords: DEFGRID2
keywords: scfconv7
keywords: smallprint printgap noloewdin
keywords: NOSOSCF
formula: C19H14ClF5N4O2
InChI: InChI=1/C19H14ClF5N4O2/c20-14-7-6-13(8-12(14)9-31-10-18(21,22)19(23,24)25)29-17(11-4-2-1-3-5-11)27-16(28-29)15(26)30/h1-8H,9-10,26H2
45 atoms
Cl 1.085373 -4.747564 1.599703
F  2.130737 1.671866 -0.741736
F  4.195933 1.241816 -0.21561
F  2.653653 0.787085 -3.322522
F  4.710221 0.45104 -2.770148
F  3.867287 2.429668 -2.634604
O  2.554564 -0.681421 0.631198
O  -5.748153 0.091385 -2.146914
N  -2.421921 -0.236549 0.164404
N  -3.464159 -0.431399 -0.638945
N  -3.328455 1.720825 -0.05042
N  -5.607355 2.275901 -1.562035
C  -1.570699 -1.317623 0.501445
C  0.647386 -2.169976 0.901927
C  -0.198279 -1.12495 0.558659
C  2.135832 -1.959789 1.041461
C  -2.350984 1.065449 0.527558
C  -2.128275 -2.558952 0.761887
C  0.072561 -3.411924 1.15969
C  2.807426 -0.588133 -0.747397
C  -1.365333 1.632231 1.449323
C  -1.295007 -3.61511 1.084925
C  3.176654 0.854396 -1.015696
C  -3.977842 0.766134 -0.741889
C  -1.156094 1.057202 2.701706
C  -0.636602 2.756378 1.069784
C  3.610331 1.137017 -2.466257
C  -0.215618 1.599984 3.562284
C  0.307035 3.292359 1.934083
C  0.520063 2.714704 3.178491
C  -5.19577 1.009554 -1.552832
H  0.219695 -0.154386 0.332196
H  2.408859 -2.053204 2.096304
H  2.685138 -2.739634 0.501441
H  -3.197859 -2.710342 0.720968
H  3.631456 -1.247132 -1.042961
H  1.936071 -0.856025 -1.35453
H  -1.716658 -4.589805 1.289944
H  -1.731019 0.19231 3.008799
H  -0.795743 3.202292 0.096512
H  -0.059498 1.153396 4.53524
H  0.876624 4.161698 1.632983
H  1.257129 3.134298 3.850767
H  -5.115021 2.991783 -1.053497
H  -6.430353 2.540051 -2.079294
elementType: Cl F O N C H
totalener: -2061.56962967 hartree
nucrepener: 3357.07878923 hartree
electener: -5418.64841890 hartree
oneelecener: -9511.49481480 hartree
twoeener: 4092.84639591 hartree
cpcmener: -0.05361903 hartree
kineticenergy: 2054.86272480 hartree
xcener: -164.587106339805 hartree
chargesum: -0.0000000
charge: -0.081058 -0.184460 -0.186835 -0.159776 -0.160590 -0.156817 -0.370293 -0.530966 0.168854 -0.307772 -0.414565 -0.216405 0.091517 0.104435 -0.211671 0.009045 0.485565 -0.196814 -0.021096 -0.057686 -0.159510 -0.107751 0.349690 0.269191 -0.167275 -0.187899 0.451998 -0.188197 -0.209842 -0.095209 0.255574 0.165349 0.134311 0.118148 0.149570 0.150715 0.135907 0.144797 0.158090 0.145381 0.160245 0.158997 0.163825 0.201654 0.199629
qa: -0.0811 -0.1845 -0.1868 -0.1598 -0.1606 -0.1568 -0.3703 -0.5310 0.1689 -0.3078 -0.4146 -0.2164 0.0915 0.1044 -0.2117 0.0090 0.4856 -0.1968 -0.0211 -0.0577 -0.1595 -0.1078 0.3497 0.2692 -0.1673 -0.1879 0.4520 -0.1882 -0.2098 -0.0952 0.2556 0.1653 0.1343 0.1181 0.1496 0.1507 0.1359 0.1448 0.1581 0.1454 0.1602 0.1590 0.1638 0.2017 0.1996
va: 1.2499 1.1117 1.1189 1.1574 1.1561 1.1627 1.9418 1.9815 3.4044 2.9766 3.0466 3.2356 3.7352 3.5015 3.9396 3.9343 3.5983 4.0406 3.9725 3.8723 3.5095 3.9926 4.2258 3.7457 3.8789 3.9384 4.4491 3.9256 3.9422 3.8494 4.3861 0.9941 0.9872 0.9923 1.0178 1.0092 0.9956 1.0046 1.0011 1.0166 0.9931 0.9940 0.9870 1.0119 1.0000
dispcorr: -0.024209336 hartree
energy: -2061.593839005393
dipole: -23.90979 25.59733 1.68754 2.95569 -2.60316 0.35253 18.56857 -16.93992 1.62866
magnitude: 2.37162 au
magnitude: 6.02819 debye
