program: Orca
programVersion: 5.0.2
elementType: Cl F F F F F O O N N N N C C C C C C C C C C C C C C C C C C C H H H H H H H H H H H H H H
charge: 0
multiplicity: 1
keywords: wb97x-d3
keywords: def2-TZVPP
keywords: def2/J RIJCOSX
keywords: DEFGRID2
keywords: scfconv7
keywords: smallprint printgap noloewdin
keywords: NOSOSCF
formula: C19H14ClF5N4O2
InChI: InChI=1/C19H14ClF5N4O2/c20-14-7-6-13(8-12(14)9-31-10-18(21,22)19(23,24)25)29-17(11-4-2-1-3-5-11)27-16(28-29)15(26)30/h1-8H,9-10,26H2
45 atoms
Cl 1.838105 -3.416119 1.442683
F  5.013324 0.086675 -0.720181
F  3.769708 1.825939 -0.291871
F  2.598844 0.228967 1.798638
F  4.64133 0.891002 1.952131
F  4.215799 -1.156534 1.455446
O  2.721905 -1.490072 -0.945825
O  -6.927368 1.248114 -0.791539
N  -2.806193 -0.107016 -0.043879
N  -4.037283 -0.551748 0.195256
N  -4.118575 1.43127 -0.831607
N  -6.803097 -0.688269 0.374072
C  -1.681494 -0.894371 0.304815
C  0.422957 -1.901909 -0.305556
C  -0.69084 -1.139347 -0.633541
C  1.512562 -2.121884 -1.320479
C  -2.861921 1.098038 -0.656204
C  -1.590157 -1.417234 1.583707
C  0.498633 -2.42431 0.984448
C  2.674682 -0.091961 -1.038436
C  -1.712525 1.916694 -1.0405
C  -0.496291 -2.195138 1.920629
C  3.815377 0.475187 -0.222336
C  -4.7910 0.399439 -0.29431
C  -0.630648 2.106716 -0.182079
C  -1.729511 2.550875 -2.281324
C  3.816264 0.095264 1.273994
C  0.426048 2.915802 -0.570301
C  -0.668101 3.354623 -2.665488
C  0.412315 3.536595 -1.812657
C  -6.274784 0.359145 -0.259317
H  -0.777359 -0.741781 -1.637217
H  1.741749 -3.183429 -1.41929
H  1.174205 -1.768422 -2.300303
H  -2.359941 -1.222883 2.31778
H  2.788616 0.253289 -2.074528
H  1.736774 0.328917 -0.660601
H  -0.420608 -2.612961 2.914863
H  -0.616181 1.643618 0.796039
H  -2.568026 2.406695 -2.949797
H  1.258361 3.065071 0.103711
H  -0.686249 3.838269 -3.633034
H  1.239734 4.165449 -2.113685
H  -6.230734 -1.390577 0.812944
H  -7.804271 -0.782438 0.44179
elementType: Cl F O N C H
totalener: -2061.56852571 hartree
nucrepener: 3427.15785219 hartree
electener: -5488.72637790 hartree
oneelecener: -9650.84172790 hartree
twoeener: 4162.11535001 hartree
cpcmener: -0.05819074 hartree
kineticenergy: 2054.88670024 hartree
xcener: -164.588954338646 hartree
chargesum: 0.0000000
charge: -0.077356 -0.190338 -0.187523 -0.166151 -0.162856 -0.156828 -0.354354 -0.528626 0.181588 -0.347051 -0.391630 -0.216556 0.071270 0.020862 -0.145267 0.027262 0.468551 -0.184590 0.000219 -0.024447 -0.138025 -0.106912 0.367795 0.268429 -0.162046 -0.178774 0.457523 -0.225581 -0.195801 -0.088863 0.263917 0.158698 0.128207 0.112668 0.152337 0.135737 0.086299 0.144022 0.159923 0.144880 0.157339 0.159133 0.163854 0.201785 0.197277
qa: -0.0774 -0.1903 -0.1875 -0.1662 -0.1629 -0.1568 -0.3544 -0.5286 0.1816 -0.3471 -0.3916 -0.2166 0.0713 0.0209 -0.1453 0.0273 0.4686 -0.1846 0.0002 -0.0244 -0.1380 -0.1069 0.3678 0.2684 -0.1620 -0.1788 0.4575 -0.2256 -0.1958 -0.0889 0.2639 0.1587 0.1282 0.1127 0.1523 0.1357 0.0863 0.1440 0.1599 0.1449 0.1573 0.1591 0.1639 0.2018 0.1973
va: 1.2468 1.1224 1.1167 1.1406 1.1522 1.1582 1.9592 1.9830 3.3597 2.8855 3.1089 3.2409 3.6633 3.5775 3.8915 3.9052 3.6445 4.0454 3.8883 3.9666 3.4706 4.0061 4.2039 3.7647 3.8288 3.9716 4.4299 3.8957 3.9645 3.8489 4.3613 0.9959 0.9933 0.9972 1.0109 1.0097 1.0048 1.0061 1.0018 1.0204 1.0063 0.9933 0.9876 1.0070 1.0021
dispcorr: -0.026812051 hartree
energy: -2061.595337759277
dipole: -32.30412 33.13374 0.82962 6.66725 -8.31401 -1.64676 -14.71072 14.84985 0.13913
magnitude: 1.84917 au
magnitude: 4.70022 debye
