program: Orca
programVersion: 5.0.2
elementType: Cl F F F F F O O N N N N C C C C C C C C C C C C C C C C C C C H H H H H H H H H H H H H H
charge: 0
multiplicity: 1
keywords: wb97x-d3
keywords: def2-TZVPP
keywords: def2/J RIJCOSX
keywords: DEFGRID2
keywords: scfconv7
keywords: smallprint printgap noloewdin
keywords: NOSOSCF
formula: C19H14ClF5N4O2
InChI: InChI=1/C19H14ClF5N4O2/c20-14-7-6-13(8-12(14)9-31-10-18(21,22)19(23,24)25)29-17(11-4-2-1-3-5-11)27-16(28-29)15(26)30/h1-8H,9-10,26H2
45 atoms
Cl 1.028115 -4.972226 -0.50078
F  5.211879 1.132408 0.577231
F  3.517719 1.38053 -0.778795
F  1.850128 1.784826 1.257186
F  3.623475 2.974391 1.501709
F  3.340987 1.211784 2.705271
O  2.294706 -0.837114 0.32638
O  -6.032717 2.201146 0.941494
N  -2.582972 -0.337092 -0.104952
N  -3.764032 -0.481224 0.487828
N  -3.480541 1.640329 -0.152039
N  -6.266135 0.027064 1.525765
C  -1.705406 -1.444835 -0.206711
C  0.514749 -2.357821 -0.037243
C  -0.358135 -1.283947 0.075707
C  1.985959 -2.202698 0.215169
C  -2.420443 0.948815 -0.498439
C  -2.218836 -2.677587 -0.573807
C  -0.017013 -3.595648 -0.388901
C  3.664083 -0.604345 0.486635
C  -1.259134 1.482504 -1.211716
C  -1.365831 -3.763842 -0.651349
C  3.889835 0.890274 0.426795
C  -4.26705 0.725181 0.440447
C  -0.706344 0.815497 -2.303981
C  -0.710583 2.691986 -0.791665
C  3.156477 1.728974 1.493254
C  0.395756 1.347767 -2.953708
C  0.391908 3.2197 -1.445916
C  0.949873 2.546605 -2.523641
C  -5.604787 1.055125 0.994017
H  0.012375 -0.319575 0.39127
H  2.271675 -2.742529 1.12797
H  2.55138 -2.653336 -0.610527
H  -3.268933 -2.800312 -0.798712
H  4.045933 -1.000699 1.434465
H  4.253337 -1.060777 -0.319991
H  -1.753588 -4.734179 -0.928458
H  -1.140287 -0.110668 -2.657985
H  -1.135472 3.213157 0.055891
H  0.818841 0.826969 -3.802175
H  0.818295 4.154958 -1.108761
H  1.811343 2.958112 -3.032679
H  -5.875008 -0.900324 1.549526
H  -7.181971 0.167617 1.922399
elementType: Cl F O N C H
totalener: -2061.56974029 hartree
nucrepener: 3391.77585279 hartree
electener: -5453.34559308 hartree
oneelecener: -9581.45641260 hartree
twoeener: 4128.11081952 hartree
cpcmener: -0.05597724 hartree
kineticenergy: 2054.89265868 hartree
xcener: -164.592169681355 hartree
chargesum: 0.0000000
charge: -0.079084 -0.185585 -0.184375 -0.151454 -0.162979 -0.161904 -0.346776 -0.528906 0.175424 -0.345960 -0.390106 -0.216207 0.043174 0.107635 -0.170741 0.019521 0.485548 -0.185805 0.007494 -0.032214 -0.153912 -0.122561 0.333443 0.269021 -0.169279 -0.178562 0.463349 -0.183300 -0.218526 -0.104896 0.261992 0.166919 0.115270 0.103433 0.150562 0.123500 0.123754 0.143659 0.159151 0.142533 0.159293 0.157492 0.161756 0.202146 0.197065
qa: -0.0791 -0.1856 -0.1844 -0.1515 -0.1630 -0.1619 -0.3468 -0.5289 0.1754 -0.3460 -0.3901 -0.2162 0.0432 0.1076 -0.1707 0.0195 0.4855 -0.1858 0.0075 -0.0322 -0.1539 -0.1226 0.3334 0.2690 -0.1693 -0.1786 0.4633 -0.1833 -0.2185 -0.1049 0.2620 0.1669 0.1153 0.1034 0.1506 0.1235 0.1238 0.1437 0.1592 0.1425 0.1593 0.1575 0.1618 0.2021 0.1971
va: 1.2524 1.1221 1.1165 1.1490 1.1505 1.1574 1.9746 1.9834 3.3709 2.8807 3.1078 3.2390 3.7677 3.5518 3.9450 3.9423 3.6050 4.0399 3.9695 3.9236 3.4566 4.0101 4.2286 3.7587 3.8678 3.9372 4.4071 3.9233 3.9264 3.8038 4.3633 0.9992 0.9850 0.9907 1.0135 1.0056 1.0033 1.0055 0.9995 1.0204 0.9934 0.9950 0.9879 1.0072 1.0022
dispcorr: -0.024967429 hartree
energy: -2061.594707720129
dipole: -21.51272 23.73479 2.22207 -5.97691 2.01628 -3.96063 -10.63927 10.39779 -0.24148
magnitude: 4.54781 au
magnitude: 11.55961 debye
