program: Orca
programVersion: 5.0.2
elementType: Cl F F F F F O O N N N N C C C C C C C C C C C C C C C C C C C H H H H H H H H H H H H H H
charge: 0
multiplicity: 1
keywords: wb97x-d3
keywords: def2-TZVPP
keywords: def2/J RIJCOSX
keywords: DEFGRID2
keywords: scfconv7
keywords: smallprint printgap noloewdin
keywords: NOSOSCF
formula: C19H14ClF5N4O2
InChI: InChI=1/C19H14ClF5N4O2/c20-14-7-6-13(8-12(14)9-31-10-18(21,22)19(23,24)25)29-17(11-4-2-1-3-5-11)27-16(28-29)15(26)30/h1-8H,9-10,26H2
45 atoms
Cl 1.820909 -4.074795 -1.982687
F  1.597484 1.028322 2.394276
F  2.272505 -0.298896 3.99247
F  4.155726 1.620841 1.762103
F  4.887968 0.185206 3.195972
F  3.736685 1.884372 3.853394
O  2.912952 -0.576732 0.516232
O  -3.829856 3.481441 1.766568
N  -1.837588 0.320577 -0.576766
N  -1.744037 0.8551 0.636204
N  -3.371309 1.857117 -0.51914
N  -2.121663 2.453517 2.839137
C  -0.974587 -0.742884 -0.936429
C  1.246744 -1.675113 -0.867035
C  0.360961 -0.645576 -0.583808
C  2.698907 -1.561335 -0.468989
C  -2.818516 0.938163 -1.276109
C  -1.462418 -1.862756 -1.589011
C  0.752527 -2.779891 -1.555165
C  2.613954 -1.027703 1.811931
C  -3.179304 0.657875 -2.666326
C  -0.582268 -2.879587 -1.915289
C  2.570277 0.157593 2.753406
C  -2.678437 1.769214 0.629793
C  -4.5259 0.550925 -3.006999
C  -2.20365 0.535893 -3.654535
C  3.865344 0.978987 2.887801
C  -4.89208 0.308752 -4.321941
C  -2.576208 0.297253 -4.967972
C  -3.918742 0.179761 -5.303308
C  -2.933371 2.647665 1.798834
H  0.713198 0.241567 -0.077416
H  3.07942 -2.531819 -0.132989
H  3.294057 -1.270859 -1.337663
H  -2.510612 -1.959176 -1.835599
H  1.633456 -1.516685 1.870609
H  3.359194 -1.748265 2.166955
H  -0.944813 -3.75683 -2.432981
H  -5.285536 0.644663 -2.242123
H  -1.155474 0.642917 -3.406707
H  -5.938939 0.219566 -4.579553
H  -1.816138 0.209173 -5.732643
H  -4.205893 -0.008481 -6.329395
H  -1.373586 1.779697 2.810407
H  -2.22006 3.023493 3.664496
elementType: Cl F O N C H
totalener: -2061.56913702 hartree
nucrepener: 3300.85177845 hartree
electener: -5362.42091547 hartree
oneelecener: -9398.51964953 hartree
twoeener: 4036.09873407 hartree
cpcmener: -0.05477198 hartree
kineticenergy: 2054.87703716 hartree
xcener: -164.588706246740 hartree
chargesum: -0.0000000
charge: -0.081211 -0.189072 -0.187310 -0.157775 -0.161866 -0.159811 -0.373115 -0.528978 0.181228 -0.344825 -0.391875 -0.219743 0.048255 0.061217 -0.161933 0.020918 0.492175 -0.196762 0.003176 -0.046963 -0.171453 -0.094183 0.352557 0.263513 -0.169062 -0.188642 0.456838 -0.199415 -0.172694 -0.109138 0.262799 0.133489 0.114404 0.132497 0.168105 0.136531 0.145632 0.144914 0.144943 0.158192 0.159792 0.160450 0.163562 0.203729 0.196905
qa: -0.0812 -0.1891 -0.1873 -0.1578 -0.1619 -0.1598 -0.3731 -0.5290 0.1812 -0.3448 -0.3919 -0.2197 0.0483 0.0612 -0.1619 0.0209 0.4922 -0.1968 0.0032 -0.0470 -0.1715 -0.0942 0.3526 0.2635 -0.1691 -0.1886 0.4568 -0.1994 -0.1727 -0.1091 0.2628 0.1335 0.1144 0.1325 0.1681 0.1365 0.1456 0.1449 0.1449 0.1582 0.1598 0.1605 0.1636 0.2037 0.1969
va: 1.2481 1.1183 1.1190 1.1586 1.1555 1.1550 1.9532 1.9837 3.3668 2.8785 3.1076 3.2363 3.7359 3.5946 3.9871 3.9226 3.5966 3.9983 3.9574 3.8834 3.4859 3.9653 4.1778 3.7683 3.9680 3.8849 4.4586 3.9545 3.9165 3.8647 4.3645 1.0536 0.9951 0.9871 0.9872 0.9934 1.0084 1.0048 1.0190 1.0005 0.9938 0.9931 0.9879 1.0088 1.0023
dispcorr: -0.023383970 hartree
energy: -2061.592520989716
dipole: -30.50756 32.28796 1.78040 -4.31837 0.69574 -3.62263 -27.74791 26.35348 -1.39443
magnitude: 4.27056 au
magnitude: 10.85491 debye
