program: Orca
programVersion: 5.0.2
elementType: Cl F F F F F O O N N N N C C C C C C C C C C C C C C C C C C C H H H H H H H H H H H H H H
charge: 0
multiplicity: 1
keywords: wb97x-d3
keywords: def2-TZVPP
keywords: def2/J RIJCOSX
keywords: DEFGRID2
keywords: scfconv7
keywords: smallprint printgap noloewdin
keywords: NOSOSCF
formula: C19H14ClF5N4O2
InChI: InChI=1/C19H14ClF5N4O2/c20-14-7-6-13(8-12(14)9-31-10-18(21,22)19(23,24)25)29-17(11-4-2-1-3-5-11)27-16(28-29)15(26)30/h1-8H,9-10,26H2
45 atoms
Cl 0.999243 -4.986593 -0.35848
F  3.371825 1.841976 -0.681825
F  1.808227 1.731445 0.840785
F  4.262992 2.639083 1.66049
F  5.137438 0.730825 1.174702
F  3.581359 0.865667 2.665367
O  2.221448 -0.992543 1.092126
O  -6.32278 0.210467 1.323975
N  -2.590323 -0.323176 -0.191572
N  -3.792688 -0.452129 0.364188
N  -3.461584 1.656961 -0.294351
N  -5.99761 2.348559 0.644017
C  -1.715368 -1.437168 -0.241803
C  0.43907 -2.404389 0.225309
C  -0.43395 -1.325071 0.272571
C  1.832193 -2.311269 0.798967
C  -2.394904 0.953066 -0.596597
C  -2.170661 -2.626942 -0.784334
C  -0.034647 -3.596866 -0.315445
C  2.678611 -0.282657 -0.028497
C  -1.216819 1.476266 -1.286438
C  -1.321963 -3.718603 -0.81201
C  2.94421 1.145427 0.39587
C  -4.27876 0.759237 0.283908
C  -0.552846 0.745204 -2.271229
C  -0.788457 2.76796 -0.983039
C  4.000937 1.343919 1.499572
C  0.530586 1.301542 -2.933385
C  0.294624 3.317979 -1.648677
C  0.957794 2.585758 -2.623438
C  -5.631685 1.077464 0.801416
H  -0.117058 -0.391757 0.718809
H  1.871821 -2.864451 1.740221
H  2.552316 -2.783635 0.12146
H  -3.172245 -2.707882 -1.183751
H  3.5931 -0.7229 -0.441271
H  1.939639 -0.246447 -0.839643
H  -1.663493 -4.657304 -1.225716
H  -0.887219 -0.247437 -2.542688
H  -1.29806 3.339724 -0.218835
H  1.038357 0.729933 -3.698617
H  0.623542 4.31843 -1.400815
H  1.803749 3.015378 -3.143285
H  -5.389148 3.018969 0.202873
H  -6.901372 2.658822 0.964896
elementType: Cl F O N C H
totalener: -2061.57023842 hartree
nucrepener: 3402.87032342 hartree
electener: -5464.44056184 hartree
oneelecener: -9602.82239421 hartree
twoeener: 4138.38183237 hartree
cpcmener: -0.05310096 hartree
kineticenergy: 2054.88064583 hartree
xcener: -164.590930138415 hartree
chargesum: 0.0000000
charge: -0.080146 -0.193318 -0.193066 -0.160939 -0.162403 -0.157440 -0.374854 -0.532981 0.174820 -0.309044 -0.418485 -0.217458 0.052382 0.114171 -0.189269 0.011571 0.470528 -0.207406 -0.017805 -0.056217 -0.104359 -0.097535 0.361455 0.264722 -0.205140 -0.192425 0.474289 -0.179754 -0.186476 -0.109740 0.261315 0.152127 0.134378 0.116559 0.151316 0.147418 0.138704 0.144272 0.159251 0.140687 0.157942 0.156492 0.160001 0.202003 0.199857
qa: -0.0801 -0.1933 -0.1931 -0.1609 -0.1624 -0.1574 -0.3749 -0.5330 0.1748 -0.3090 -0.4185 -0.2175 0.0524 0.1142 -0.1893 0.0116 0.4705 -0.2074 -0.0178 -0.0562 -0.1044 -0.0975 0.3615 0.2647 -0.2051 -0.1924 0.4743 -0.1798 -0.1865 -0.1097 0.2613 0.1521 0.1344 0.1166 0.1513 0.1474 0.1387 0.1443 0.1593 0.1407 0.1579 0.1565 0.1600 0.2020 0.1999
va: 1.2503 1.1101 1.1075 1.1532 1.1552 1.1591 1.9516 1.9789 3.3997 2.9778 3.0524 3.2364 3.7205 3.4918 3.9465 3.9405 3.6241 4.0620 3.9841 3.9115 3.4573 3.9754 4.1341 3.7586 3.8648 3.9577 4.4825 3.8709 3.9222 3.8116 4.3809 1.0271 0.9869 0.9943 1.0120 1.0124 0.9876 1.0045 1.0001 1.0229 0.9949 0.9940 0.9883 1.0116 0.9999
dispcorr: -0.026437673 hartree
energy: -2061.596676093516
dipole: -24.02138 26.30064 2.27926 1.70836 -1.25869 0.44966 -15.09793 12.70653 -2.39140
magnitude: 3.33407 au
magnitude: 8.47452 debye
