program: Orca
programVersion: 5.0.2
elementType: Cl F F F F F O O N N N N C C C C C C C C C C C C C C C C C C C H H H H H H H H H H H H H H
charge: 0
multiplicity: 1
keywords: wb97x-d3
keywords: def2-TZVPP
keywords: def2/J RIJCOSX
keywords: DEFGRID2
keywords: scfconv7
keywords: smallprint printgap noloewdin
keywords: NOSOSCF
formula: C19H14ClF5N4O2
InChI: InChI=1/C19H14ClF5N4O2/c20-14-7-6-13(8-12(14)9-31-10-18(21,22)19(23,24)25)29-17(11-4-2-1-3-5-11)27-16(28-29)15(26)30/h1-8H,9-10,26H2
45 atoms
Cl 1.062311 -4.933836 -0.288306
F  3.491491 1.836789 -0.737841
F  1.946957 1.855422 0.806123
F  3.677456 0.880178 2.618043
F  4.49275 2.574199 1.577329
F  5.188935 0.58936 1.107507
O  2.195461 -0.893307 1.094809
O  -6.431853 0.001126 1.225856
N  -2.640036 -0.356014 -0.183316
N  -3.852893 -0.540131 0.333107
N  -3.576012 1.596341 -0.259337
N  -6.171801 2.166466 0.609828
C  -1.729378 -1.441337 -0.231962
C  0.441205 -2.357217 0.262404
C  -0.455804 -1.29662 0.293745
C  1.823352 -2.22674 0.85352
C  -2.477885 0.936672 -0.548842
C  -2.149129 -2.643654 -0.776582
C  0.001053 -3.563968 -0.274241
C  2.65435 -0.225459 -0.050823
C  -1.302821 1.51669 -1.197684
C  -1.275845 -3.715711 -0.788909
C  3.030052 1.182689 0.35268
C  -4.378167 0.655537 0.27016
C  -0.91338 2.806682 -0.840744
C  -0.608743 0.840515 -2.200306
C  4.116376 1.30483 1.439502
C  0.162236 3.409495 -1.472215
C  0.466197 1.449993 -2.829002
C  0.855437 2.73221 -2.465729
C  -5.758915 0.907905 0.749549
H  -0.162126 -0.355138 0.739856
H  1.852858 -2.738585 1.81847
H  2.559575 -2.71932 0.208554
H  -3.143217 -2.751302 -1.187693
H  3.522926 -0.72807 -0.491228
H  1.889029 -0.148073 -0.834461
H  -1.591229 -4.663478 -1.20247
H  -1.448124 3.336729 -0.063858
H  -0.914253 -0.149764 -2.51164
H  0.460226 4.408957 -1.18473
H  0.996725 0.922061 -3.609952
H  1.69374 3.204445 -2.960268
H  -5.578703 2.872976 0.20621
H  -7.099272 2.430127 0.903761
elementType: Cl F O N C H
totalener: -2061.57049822 hartree
nucrepener: 3392.09645917 hartree
electener: -5453.66695740 hartree
oneelecener: -9581.25133265 hartree
twoeener: 4127.58437525 hartree
cpcmener: -0.05298523 hartree
kineticenergy: 2054.88502148 hartree
xcener: -164.591687862715 hartree
chargesum: 0.0000000
charge: -0.080558 -0.194684 -0.193633 -0.157042 -0.161183 -0.162705 -0.374160 -0.532692 0.175597 -0.309280 -0.418254 -0.217373 0.057986 0.114188 -0.188224 0.012489 0.469412 -0.209151 -0.018936 -0.055772 -0.115110 -0.097610 0.363038 0.264550 -0.177826 -0.195364 0.474162 -0.196002 -0.192348 -0.101615 0.261584 0.150852 0.133993 0.114935 0.150673 0.146420 0.138838 0.144490 0.141573 0.159451 0.155717 0.157788 0.160034 0.201890 0.199863
qa: -0.0806 -0.1947 -0.1936 -0.1570 -0.1612 -0.1627 -0.3742 -0.5327 0.1756 -0.3093 -0.4183 -0.2174 0.0580 0.1142 -0.1882 0.0125 0.4694 -0.2092 -0.0189 -0.0558 -0.1151 -0.0976 0.3630 0.2646 -0.1778 -0.1954 0.4742 -0.1960 -0.1923 -0.1016 0.2616 0.1509 0.1340 0.1149 0.1507 0.1464 0.1388 0.1445 0.1416 0.1595 0.1557 0.1578 0.1600 0.2019 0.1999
va: 1.2497 1.1088 1.1081 1.1590 1.1529 1.1542 1.9503 1.9791 3.3986 2.9777 3.0529 3.2368 3.7153 3.4953 3.9417 3.9372 3.6242 4.0619 3.9831 3.9055 3.4606 3.9759 4.1409 3.7595 3.9585 3.8539 4.4826 3.9267 3.8786 3.8041 4.3804 1.0264 0.9869 0.9962 1.0130 1.0129 0.9887 1.0044 1.0219 1.0000 0.9945 0.9952 0.9884 1.0115 0.9999
dispcorr: -0.026214868 hartree
energy: -2061.596713091707
dipole: -25.56382 27.71558 2.15176 2.13327 -1.55948 0.57379 -14.28317 12.02778 -2.25539
magnitude: 3.16955 au
magnitude: 8.05637 debye
