program: Orca
programVersion: 5.0.2
elementType: Cl F F F F F O O N N N N C C C C C C C C C C C C C C C C C C C H H H H H H H H H H H H H H
charge: 0
multiplicity: 1
keywords: wb97x-d3
keywords: def2-TZVPP
keywords: def2/J RIJCOSX
keywords: DEFGRID2
keywords: scfconv7
keywords: smallprint printgap noloewdin
keywords: NOSOSCF
formula: C19H14ClF5N4O2
InChI: InChI=1/C19H14ClF5N4O2/c20-14-7-6-13(8-12(14)9-31-10-18(21,22)19(23,24)25)29-17(11-4-2-1-3-5-11)27-16(28-29)15(26)30/h1-8H,9-10,26H2
45 atoms
Cl 1.861326 -3.394188 1.368361
F  3.42233 1.799806 0.089838
F  2.145285 0.326895 1.069857
F  4.672758 0.668334 2.100605
F  5.523918 -0.010109 0.242028
F  4.271104 -1.323959 1.402348
O  2.830227 -1.535242 -1.039299
O  -6.877316 1.344994 -0.654812
N  -2.716043 0.017573 -0.089537
N  -3.93209 -0.413983 0.234984
N  -4.07549 1.496876 -0.912332
N  -6.684924 -0.600059 0.486951
C  -1.581367 -0.755707 0.260546
C  0.500839 -1.805066 -0.354887
C  -0.594881 -1.015458 -0.678466
C  1.564432 -2.064816 -1.386047
C  -2.80966 1.178095 -0.778636
C  -1.493558 -1.277075 1.540401
C  0.560543 -2.34479 0.928146
C  2.952276 -0.140513 -1.113624
C  -1.690947 1.978964 -1.275644
C  -0.419342 -2.084856 1.870806
C  3.213757 0.469933 0.252597
C  -4.71485 0.499516 -0.278764
C  -0.584965 2.265192 -0.477241
C  -1.770824 2.508002 -2.562293
C  4.440733 -0.067601 1.014796
C  0.426294 3.078227 -0.965953
C  -0.751138 3.310177 -3.048975
C  0.347425 3.598688 -2.251043
C  -6.194662 0.452614 -0.167167
H  -0.676482 -0.62031 -1.683164
H  1.716495 -3.137475 -1.513609
H  1.232628 -1.668581 -2.350665
H  -2.255772 -1.069012 2.278387
H  3.78415 0.118077 -1.774107
H  2.058414 0.347361 -1.520374
H  -0.353117 -2.507561 2.863612
H  -0.521924 1.881629 0.532997
H  -2.626442 2.285642 -3.186031
H  1.271048 3.316169 -0.335521
H  -0.817662 3.712091 -4.051139
H  1.139718 4.231681 -2.628142
H  -6.08751 -1.314013 0.870557
H  -7.680711 -0.700206 0.606521
elementType: Cl F O N C H
totalener: -2061.56650761 hartree
nucrepener: 3432.10708986 hartree
electener: -5493.67359747 hartree
oneelecener: -9661.31831294 hartree
twoeener: 4167.64471547 hartree
cpcmener: -0.05701458 hartree
kineticenergy: 2054.90085051 hartree
xcener: -164.590812579761 hartree
chargesum: 0.0000000
charge: -0.076620 -0.194299 -0.192569 -0.162939 -0.164285 -0.152059 -0.359419 -0.529197 0.180594 -0.347045 -0.390670 -0.216912 0.053785 -0.020496 -0.110604 0.024672 0.484856 -0.185313 0.041188 -0.041319 -0.158370 -0.119465 0.342474 0.269402 -0.167495 -0.173473 0.469711 -0.221179 -0.202603 -0.086748 0.263219 0.161047 0.124531 0.112054 0.151717 0.145931 0.124861 0.143501 0.156390 0.143808 0.156664 0.159222 0.163926 0.202019 0.197506
qa: -0.0766 -0.1943 -0.1926 -0.1629 -0.1643 -0.1521 -0.3594 -0.5292 0.1806 -0.3470 -0.3907 -0.2169 0.0538 -0.0205 -0.1106 0.0247 0.4849 -0.1853 0.0412 -0.0413 -0.1584 -0.1195 0.3425 0.2694 -0.1675 -0.1735 0.4697 -0.2212 -0.2026 -0.0867 0.2632 0.1610 0.1245 0.1121 0.1517 0.1459 0.1249 0.1435 0.1564 0.1438 0.1567 0.1592 0.1639 0.2020 0.1975
va: 1.2493 1.1114 1.0999 1.1504 1.1508 1.1615 1.9531 1.9828 3.3635 2.8845 3.1078 3.2411 3.6957 3.5679 3.8691 3.8950 3.6166 4.0488 3.8675 3.9809 3.4751 4.0281 4.0972 3.7616 3.8504 3.9710 4.4722 3.9083 3.9681 3.8514 4.3625 0.9910 0.9927 0.9988 1.0126 1.0049 0.9915 1.0064 1.0073 1.0207 1.0091 0.9936 0.9874 1.0070 1.0020
dispcorr: -0.026772043 hartree
energy: -2061.593279651041
dipole: -30.81648 32.32678 1.51031 7.62289 -9.23939 -1.61650 -17.32711 16.93466 -0.39245
magnitude: 2.24680 au
magnitude: 5.71092 debye
