program: Orca
programVersion: 5.0.2
elementType: Cl F F F F F O O N N N N C C C C C C C C C C C C C C C C C C C H H H H H H H H H H H H H H
charge: 0
multiplicity: 1
keywords: wb97x-d3
keywords: def2-TZVPP
keywords: def2/J RIJCOSX
keywords: DEFGRID2
keywords: scfconv7
keywords: smallprint printgap noloewdin
keywords: NOSOSCF
formula: C19H14ClF5N4O2
InChI: InChI=1/C19H14ClF5N4O2/c20-14-7-6-13(8-12(14)9-31-10-18(21,22)19(23,24)25)29-17(11-4-2-1-3-5-11)27-16(28-29)15(26)30/h1-8H,9-10,26H2
45 atoms
Cl 1.402162 -3.933468 1.165359
F  3.453602 2.123381 -0.163628
F  3.225663 0.660554 1.437977
F  5.163672 0.200043 -1.428882
F  5.111566 -0.883676 0.435036
F  5.790926 1.155025 0.396766
O  2.506671 -1.264079 -0.552399
O  -7.033231 -0.60716 -0.581259
N  -3.015756 -0.235729 -0.063531
N  -4.268698 -0.662781 -0.190441
N  -4.160004 1.548253 -0.508511
N  -6.90851 1.620636 -0.971643
C  -1.965121 -1.146624 0.204452
C  0.220836 -2.009704 -0.33549
C  -0.841287 -1.156016 -0.606392
C  1.457443 -1.972495 -1.190427
C  -2.954445 1.102894 -0.245093
C  -2.074078 -2.016281 1.27655
C  0.106666 -2.860756 0.762682
C  2.392314 0.124431 -0.708291
C  -1.749171 1.923481 -0.120918
C  -1.032761 -2.885098 1.550706
C  3.469623 0.798945 0.113248
C  -4.920936 0.438655 -0.459864
C  -1.481041 2.885377 -1.092222
C  -0.897627 1.789772 0.975386
C  4.911468 0.302894 -0.125458
C  -0.366003 3.700605 -0.97201
C  0.212267 2.611835 1.092612
C  0.481147 3.565759 0.119303
C  -6.388221 0.4303 -0.676235
H  -0.78209 -0.497574 -1.464545
H  1.830037 -2.978503 -1.382144
H  1.220796 -1.524453 -2.161055
H  -2.956004 -2.01565 1.902356
H  2.499192 0.423522 -1.757302
H  1.428795 0.514058 -0.354682
H  -1.10788 -3.567483 2.385886
H  -2.139483 2.990342 -1.944503
H  -1.107201 1.06081 1.747792
H  -0.15967 4.442008 -1.73229
H  0.864545 2.510439 1.949448
H  1.346146 4.20822 0.215248
H  -6.336132 2.446879 -1.029786
H  -7.900597 1.711769 -1.124303
elementType: Cl F O N C H
totalener: -2061.56967611 hartree
nucrepener: 3368.01391909 hartree
electener: -5429.58359520 hartree
oneelecener: -9532.87005694 hartree
twoeener: 4103.28646174 hartree
cpcmener: -0.05589503 hartree
kineticenergy: 2054.88240853 hartree
xcener: -164.586809118292 hartree
chargesum: -0.0000000
charge: -0.075235 -0.190858 -0.195383 -0.162141 -0.157333 -0.161121 -0.363714 -0.532129 0.167925 -0.306455 -0.417470 -0.217958 0.054362 0.003961 -0.133534 0.031883 0.474453 -0.172081 0.018313 -0.006082 -0.145464 -0.121774 0.350111 0.267174 -0.173492 -0.164031 0.469118 -0.181050 -0.202156 -0.109907 0.258705 0.159990 0.119039 0.116570 0.152577 0.129735 0.096597 0.145031 0.145147 0.154612 0.159088 0.153124 0.160219 0.201769 0.199864
qa: -0.0752 -0.1909 -0.1954 -0.1621 -0.1573 -0.1611 -0.3637 -0.5321 0.1679 -0.3065 -0.4175 -0.2180 0.0544 0.0040 -0.1335 0.0319 0.4745 -0.1721 0.0183 -0.0061 -0.1455 -0.1218 0.3501 0.2672 -0.1735 -0.1640 0.4691 -0.1810 -0.2022 -0.1099 0.2587 0.1600 0.1190 0.1166 0.1526 0.1297 0.0966 0.1450 0.1451 0.1546 0.1591 0.1531 0.1602 0.2018 0.1999
va: 1.2515 1.1125 1.1124 1.1550 1.1568 1.1530 1.9548 1.9801 3.4012 2.9789 3.0505 3.2351 3.6875 3.5898 3.8735 3.9246 3.6278 4.0271 3.9467 3.9596 3.5116 4.0065 4.1619 3.7500 3.9638 3.8394 4.4812 3.9470 3.8932 3.8260 4.3825 0.9946 0.9982 0.9953 1.0109 1.0087 0.9924 1.0049 1.0176 1.0015 0.9929 1.0059 0.9926 1.0120 1.0000
dispcorr: -0.025951109 hartree
energy: -2061.595627218016
dipole: -35.62958 36.48972 0.86014 11.34548 -9.18200 2.16349 -6.70101 5.68927 -1.01173
magnitude: 2.53853 au
magnitude: 6.45243 debye
