program: Orca
programVersion: 5.0.2
elementType: Cl F F F F F O O N N N N C C C C C C C C C C C C C C C C C C C H H H H H H H H H H H H H H
charge: 0
multiplicity: 1
keywords: wb97x-d3
keywords: def2-TZVPP
keywords: def2/J RIJCOSX
keywords: DEFGRID2
keywords: scfconv7
keywords: smallprint printgap noloewdin
keywords: NOSOSCF
formula: C19H14ClF5N4O2
InChI: InChI=1/C19H14ClF5N4O2/c20-14-7-6-13(8-12(14)9-31-10-18(21,22)19(23,24)25)29-17(11-4-2-1-3-5-11)27-16(28-29)15(26)30/h1-8H,9-10,26H2
45 atoms
Cl 2.175879 -2.346164 2.782779
F  4.762185 -1.498162 -1.489177
F  3.51456 -0.267106 -2.787737
F  2.161409 0.564257 -0.399293
F  4.206277 1.149524 -0.728916
F  3.750448 -0.395549 0.693276
O  2.498281 -2.741238 -0.457466
O  -5.498252 -1.388769 -2.161078
N  -2.40952 0.11939 0.016414
N  -3.27278 -0.644057 -0.649006
N  -3.898637 1.498988 -0.743601
N  -6.10405 0.790577 -2.294538
C  -1.311958 -0.472157 0.688182
C  0.467663 -2.102275 0.691362
C  -0.612032 -1.494544 0.065089
C  1.23054 -3.190979 -0.010382
C  -2.787904 1.418246 -0.05115
C  -0.957333 -0.048598 1.958503
C  0.835044 -1.638625 1.953286
C  2.457786 -2.002775 -1.650129
C  -2.073058 2.55215 0.535529
C  0.129799 -0.629871 2.587387
C  3.535248 -0.939202 -1.612257
C  -4.149133 0.221666 -1.08586
C  -0.698482 2.707029 0.368135
C  -2.793603 3.497795 1.261248
C  3.41149 0.109886 -0.485242
C  -0.050945 3.790489 0.939979
C  -2.140274 4.579417 1.83149
C  -0.768459 4.724129 1.676644
C  -5.313987 -0.205993 -1.898833
H  -0.905501 -1.831148 -0.920987
H  1.420233 -4.026026 0.664547
H  0.635112 -3.577948 -0.842773
H  -1.522731 0.715953 2.472618
H  2.650781 -2.643819 -2.519096
H  1.494248 -1.513797 -1.821585
H  0.412146 -0.302952 3.578278
H  -0.134153 1.991753 -0.215018
H  -3.861169 3.379376 1.392588
H  1.016367 3.906855 0.807641
H  -2.703675 5.306445 2.400961
H  -0.259061 5.566324 2.125975
H  -5.89913 1.748317 -2.060762
H  -6.914592 0.597429 -2.86167
elementType: Cl F O N C H
totalener: -2061.56757774 hartree
nucrepener: 3410.28974881 hartree
electener: -5471.85732655 hartree
oneelecener: -9618.04777979 hartree
twoeener: 4146.19045324 hartree
cpcmener: -0.05473549 hartree
kineticenergy: 2054.89180864 hartree
xcener: -164.589462766668 hartree
chargesum: 0.0000000
charge: -0.079913 -0.190960 -0.189300 -0.162743 -0.163146 -0.157227 -0.363287 -0.531827 0.169581 -0.307897 -0.417705 -0.216460 0.041466 -0.043479 -0.093498 0.020657 0.495441 -0.177834 0.049180 -0.033046 -0.164040 -0.109806 0.359143 0.268754 -0.203389 -0.181852 0.458431 -0.167278 -0.191110 -0.113748 0.257618 0.143279 0.122406 0.118628 0.170639 0.132833 0.114610 0.142866 0.168365 0.143980 0.157534 0.159741 0.163215 0.201475 0.199704
qa: -0.0799 -0.1910 -0.1893 -0.1627 -0.1631 -0.1572 -0.3633 -0.5318 0.1696 -0.3079 -0.4177 -0.2165 0.0415 -0.0435 -0.0935 0.0207 0.4954 -0.1778 0.0492 -0.0330 -0.1640 -0.1098 0.3591 0.2688 -0.2034 -0.1819 0.4584 -0.1673 -0.1911 -0.1137 0.2576 0.1433 0.1224 0.1186 0.1706 0.1328 0.1146 0.1429 0.1684 0.1440 0.1575 0.1597 0.1632 0.2015 0.1997
va: 1.2434 1.1193 1.1199 1.1424 1.1520 1.1557 1.9369 1.9805 3.3979 2.9763 3.0429 3.2360 3.7346 3.6472 3.9034 3.9094 3.5883 3.9834 3.8536 3.9274 3.4986 4.0093 4.2202 3.7479 3.8810 3.9735 4.4072 3.9209 3.9469 3.8736 4.3832 1.0229 0.9971 0.9932 0.9827 1.0070 1.0027 1.0071 1.0037 1.0193 0.9962 0.9934 0.9880 1.0123 1.0000
dispcorr: -0.025339971 hartree
energy: -2061.592917715609
dipole: -33.84356 33.44330 -0.40026 12.14318 -9.88167 2.26151 2.45963 -1.79760 0.66203
magnitude: 2.39017 au
magnitude: 6.07534 debye
