program: Orca
programVersion: 5.0.2
elementType: Cl F F F F F O O N N N N C C C C C C C C C C C C C C C C C C C H H H H H H H H H H H H H H
charge: 0
multiplicity: 1
keywords: wb97x-d3
keywords: def2-TZVPP
keywords: def2/J RIJCOSX
keywords: DEFGRID2
keywords: scfconv7
keywords: smallprint printgap noloewdin
keywords: NOSOSCF
formula: C19H14ClF5N4O2
InChI: InChI=1/C19H14ClF5N4O2/c20-14-7-6-13(8-12(14)9-31-10-18(21,22)19(23,24)25)29-17(11-4-2-1-3-5-11)27-16(28-29)15(26)30/h1-8H,9-10,26H2
45 atoms
Cl 1.097362 -4.966031 -0.607248
F  4.73556 0.441771 0.964342
F  3.828311 1.657701 -0.602101
F  2.902862 1.139192 2.721033
F  1.615542 1.981472 1.213994
F  3.515834 2.895995 1.644921
O  2.374058 -1.091353 1.076337
O  -6.180626 0.126126 1.564231
N  -2.48604 -0.327179 -0.058397
N  -3.672339 -0.482764 0.523275
N  -3.361099 1.654006 -0.054241
N  -5.876346 2.29449 0.980152
C  -1.612889 -1.436691 -0.191772
C  0.54256 -2.43854 0.18987
C  -0.33179 -1.367337 0.329798
C  1.94121 -2.388889 0.754215
C  -2.302611 0.964543 -0.414068
C  -2.068484 -2.575712 -0.833316
C  0.067234 -3.581331 -0.447528
C  2.736219 -0.318483 -0.038693
C  -1.137367 1.509992 -1.108886
C  -1.220422 -3.661332 -0.952215
C  3.552948 0.856147 0.451895
C  -4.16125 0.730184 0.507041
C  -0.678963 2.77605 -0.750334
C  -0.505574 0.816354 -2.141074
C  2.882724 1.731297 1.532804
C  0.408656 3.334039 -1.402618
C  0.580879 1.380803 -2.790684
C  1.045102 2.635825 -2.419046
C  -5.503515 1.018936 1.067797
H  -0.016279 -0.473453 0.852342
H  1.979069 -2.966054 1.681054
H  2.643517 -2.857531 0.055783
H  -3.068765 -2.622497 -1.241074
H  3.359884 -0.886253 -0.741101
H  1.871297 0.05362 -0.598624
H  -1.561127 -4.561414 -1.444628
H  -1.164891 3.321252 0.047726
H  -0.868316 -0.152329 -2.458423
H  0.763033 4.313375 -1.1103
H  1.062587 0.838323 -3.592944
H  1.895637 3.071303 -2.92643
H  -5.279336 2.989394 0.56225
H  -6.773258 2.586599 1.335608
elementType: Cl F O N C H
totalener: -2061.56972969 hartree
nucrepener: 3431.27652310 hartree
electener: -5492.84625279 hartree
oneelecener: -9659.26319626 hartree
twoeener: 4166.41694346 hartree
cpcmener: -0.05332772 hartree
kineticenergy: 2054.88913391 hartree
xcener: -164.592107225323 hartree
chargesum: -0.0000000
charge: -0.080106 -0.188956 -0.187209 -0.160085 -0.151737 -0.163769 -0.370645 -0.532875 0.172731 -0.306679 -0.418974 -0.217465 0.057803 0.122391 -0.210623 -0.002516 0.471213 -0.209985 -0.011126 0.014013 -0.108913 -0.091782 0.351373 0.264349 -0.196317 -0.186555 0.459441 -0.185381 -0.168466 -0.118864 0.260458 0.161257 0.133934 0.114167 0.151994 0.139538 0.076600 0.144942 0.140524 0.156358 0.156497 0.156350 0.161193 0.201929 0.199972
qa: -0.0801 -0.1890 -0.1872 -0.1601 -0.1517 -0.1638 -0.3706 -0.5329 0.1727 -0.3067 -0.4190 -0.2175 0.0578 0.1224 -0.2106 -0.0025 0.4712 -0.2100 -0.0111 0.0140 -0.1089 -0.0918 0.3514 0.2643 -0.1963 -0.1866 0.4594 -0.1854 -0.1685 -0.1189 0.2605 0.1613 0.1339 0.1142 0.1520 0.1395 0.0766 0.1449 0.1405 0.1564 0.1565 0.1564 0.1612 0.2019 0.2000
va: 1.2502 1.1233 1.1140 1.1570 1.1474 1.1512 1.9676 1.9790 3.4022 2.9777 3.0534 3.2365 3.7114 3.4913 3.9708 3.9470 3.6296 4.0605 3.9747 3.8703 3.4736 3.9666 4.2424 3.7573 3.9469 3.8473 4.4123 3.8991 3.8587 3.8124 4.3818 1.0130 0.9870 0.9970 1.0112 1.0132 1.0258 1.0043 1.0229 0.9999 0.9943 0.9957 0.9879 1.0114 0.9998
dispcorr: -0.026963307 hartree
energy: -2061.596692998150
dipole: -21.88149 23.69722 1.81573 1.49556 -0.79566 0.69990 -14.24791 11.83156 -2.41635
magnitude: 3.10250 au
magnitude: 7.88592 debye
