program: Orca
programVersion: 5.0.2
elementType: Cl F F F F F O O N N N N C C C C C C C C C C C C C C C C C C C H H H H H H H H H H H H H H
charge: 0
multiplicity: 1
keywords: wb97x-d3
keywords: def2-TZVPP
keywords: def2/J RIJCOSX
keywords: DEFGRID2
keywords: scfconv7
keywords: smallprint printgap noloewdin
keywords: NOSOSCF
formula: C19H14ClF5N4O2
InChI: InChI=1/C19H14ClF5N4O2/c20-14-7-6-13(8-12(14)9-31-10-18(21,22)19(23,24)25)29-17(11-4-2-1-3-5-11)27-16(28-29)15(26)30/h1-8H,9-10,26H2
45 atoms
Cl 1.475118 -1.428361 3.842997
F  4.254991 0.499959 -2.007786
F  4.526023 -0.373019 -0.031538
F  4.468086 -2.852502 -1.035768
F  5.844205 -1.593862 -2.10454
F  3.958452 -2.119474 -3.001076
O  1.911664 -1.768648 -0.550078
O  -4.797297 -1.660184 -2.908507
N  -2.632115 0.247248 -0.024333
N  -3.162853 -0.626558 -0.876464
N  -4.125754 1.375439 -1.110091
N  -5.774031 0.376467 -3.110097
C  -1.65153 -0.168701 0.910014
C  0.500564 -1.161597 1.332173
C  -0.493582 -0.770502 0.445297
C  1.772813 -1.814751 0.849656
C  -3.208657 1.461658 -0.175586
C  -1.864091 0.036895 2.262148
C  0.276581 -0.942838 2.689885
C  2.398106 -0.573228 -1.091897
C  -2.863578 2.675474 0.565021
C  -0.886065 -0.354403 3.159002
C  3.915738 -0.554288 -1.228467
C  -4.057458 0.090857 -1.50669
C  -3.887242 3.547998 0.931102
C  -1.543037 2.992855 0.881552
C  4.55489 -1.808756 -1.852646
C  -3.595673 4.710838 1.626042
C  -1.257597 4.15941 1.572898
C  -2.281461 5.016612 1.952542
C  -4.911371 -0.491221 -2.575918
H  -0.368921 -0.925217 -0.61826
H  2.633322 -1.373754 1.36088
H  1.760685 -2.873471 1.121204
H  -2.778421 0.489757 2.62113
H  1.967661 -0.460652 -2.088764
H  2.108014 0.312751 -0.513058
H  -1.035553 -0.206172 4.219656
H  -4.913212 3.310132 0.681422
H  -0.730365 2.34687 0.576053
H  -4.397222 5.378379 1.913786
H  -0.230003 4.400587 1.811288
H  -2.054558 5.924237 2.496782
H  -5.821566 1.331799 -2.794498
H  -6.400669 0.083602 -3.842891
elementType: Cl F O N C H
totalener: -2061.57602138 hartree
nucrepener: 3248.64848853 hartree
electener: -5310.22450991 hartree
oneelecener: -9294.29352026 hartree
twoeener: 3984.06901035 hartree
cpcmener: -0.04485851 hartree
kineticenergy: 2054.86563450 hartree
xcener: -164.584049049646 hartree
chargesum: 0.0000000
charge: -0.077950 -0.187254 -0.190849 -0.156336 -0.159875 -0.161956 -0.367095 -0.489276 0.175005 -0.304420 -0.417208 -0.224646 0.025467 0.056575 -0.160990 0.020334 0.459994 -0.178477 0.009046 -0.020583 -0.121535 -0.097491 0.323867 0.265295 -0.180336 -0.213642 0.460504 -0.180399 -0.154896 -0.118400 0.238574 0.141335 0.115430 0.133996 0.160099 0.139383 0.127538 0.143181 0.140499 0.161945 0.157092 0.155608 0.160560 0.197638 0.194646
qa: -0.0780 -0.1873 -0.1908 -0.1563 -0.1599 -0.1620 -0.3671 -0.4893 0.1750 -0.3044 -0.4172 -0.2246 0.0255 0.0566 -0.1610 0.0203 0.4600 -0.1785 0.0090 -0.0206 -0.1215 -0.0975 0.3239 0.2653 -0.1803 -0.2136 0.4605 -0.1804 -0.1549 -0.1184 0.2386 0.1413 0.1154 0.1340 0.1601 0.1394 0.1275 0.1432 0.1405 0.1619 0.1571 0.1556 0.1606 0.1976 0.1946
va: 1.2530 1.1202 1.1091 1.1588 1.1545 1.1559 1.9575 2.0349 3.3754 2.9639 3.0497 3.2148 3.7460 3.6053 3.9853 3.8889 3.6337 3.9951 3.9702 3.8805 3.4983 3.9718 4.2027 3.7404 3.9828 3.9092 4.4469 3.9493 3.9112 3.8850 4.4080 1.0359 1.0016 0.9876 0.9950 1.0024 1.0023 1.0051 1.0230 0.9962 0.9945 0.9946 0.9891 1.0152 1.0029
dispcorr: -0.023114500 hartree
energy: -2061.599135879747
dipole: -42.07806 41.46196 -0.61610 24.44937 -21.17698 3.27238 9.01668 -7.19463 1.82205
magnitude: 3.79578 au
magnitude: 9.64810 debye
