program: Orca
programVersion: 5.0.2
elementType: Cl F F F F F O O N N N N C C C C C C C C C C C C C C C C C C C H H H H H H H H H H H H H H
charge: 0
multiplicity: 1
keywords: wb97x-d3
keywords: def2-TZVPP
keywords: def2/J RIJCOSX
keywords: DEFGRID2
keywords: scfconv7
keywords: smallprint printgap noloewdin
keywords: NOSOSCF
formula: C19H14ClF5N4O2
InChI: InChI=1/C19H14ClF5N4O2/c20-14-7-6-13(8-12(14)9-31-10-18(21,22)19(23,24)25)29-17(11-4-2-1-3-5-11)27-16(28-29)15(26)30/h1-8H,9-10,26H2
45 atoms
Cl 1.086346 -4.194877 1.841067
F  3.679239 1.859191 0.582838
F  4.311928 -0.228725 0.439227
F  4.312482 -0.043106 -2.281511
F  5.508766 1.462094 -1.317833
F  3.598668 1.988612 -2.16659
O  1.946449 -0.860197 -0.951859
O  -6.708167 -0.620067 -1.361028
N  -2.898673 -0.263732 0.022947
N  -4.10538 -0.678673 -0.353292
N  -3.900544 1.520688 -0.684881
N  -6.501228 1.613333 -1.695226
C  -1.938234 -1.20174 0.470129
C  0.307154 -2.065425 0.368798
C  -0.66131 -1.171048 -0.065165
C  1.713432 -2.010069 -0.175311
C  -2.781192 1.070999 -0.168217
C  -2.297859 -2.147991 1.414645
C  -0.07062 -3.020155 1.308537
C  2.112599 0.334007 -0.234651
C  -1.616386 1.892148 0.175457
C  -1.354609 -3.073274 1.825381
C  3.577417 0.734052 -0.165836
C  -4.673929 0.421375 -0.773833
C  -0.997515 1.784995 1.419824
C  -1.155727 2.83168 -0.744861
C  4.260882 1.037329 -1.51172
C  0.071913 2.60915 1.735417
C  -0.078925 3.645675 -0.427337
C  0.537332 3.535676 0.811795
C  -6.06322 0.414762 -1.304265
H  -0.424242 -0.451334 -0.836583
H  2.429665 -2.091946 0.649159
H  1.892132 -2.865729 -0.831885
H  -3.297218 -2.170705 1.827259
H  1.546103 1.129617 -0.726527
H  1.745976 0.270412 0.796733
H  -1.620005 -3.825964 2.554993
H  -1.36022 1.076105 2.153581
H  -1.635329 2.920613 -1.71122
H  0.540347 2.529379 2.707719
H  0.277962 4.367622 -1.150358
H  1.372614 4.177293 1.060691
H  -5.919257 2.432654 -1.629605
H  -7.428223 1.715482 -2.077831
elementType: Cl F O N C H
totalener: -2061.57647960 hartree
nucrepener: 3366.39194835 hartree
electener: -5427.96842795 hartree
oneelecener: -9529.14570783 hartree
twoeener: 4101.17727988 hartree
cpcmener: -0.04305568 hartree
kineticenergy: 2054.86236039 hartree
xcener: -164.585643921806 hartree
chargesum: -0.0000000
charge: -0.078434 -0.186559 -0.190466 -0.155928 -0.160232 -0.162421 -0.376924 -0.489057 0.168414 -0.302914 -0.413328 -0.224001 0.062564 0.075267 -0.178892 0.030517 0.472346 -0.198816 -0.008915 -0.034262 -0.150094 -0.099338 0.349943 0.268207 -0.175006 -0.162087 0.454869 -0.189540 -0.193985 -0.108609 0.237414 0.158537 0.112159 0.131048 0.150207 0.136689 0.134689 0.142308 0.153209 0.141625 0.155222 0.153684 0.158884 0.197113 0.194893
qa: -0.0784 -0.1866 -0.1905 -0.1559 -0.1602 -0.1624 -0.3769 -0.4891 0.1684 -0.3029 -0.4133 -0.2240 0.0626 0.0753 -0.1789 0.0305 0.4723 -0.1988 -0.0089 -0.0343 -0.1501 -0.0993 0.3499 0.2682 -0.1750 -0.1621 0.4549 -0.1895 -0.1940 -0.1086 0.2374 0.1585 0.1122 0.1310 0.1502 0.1367 0.1347 0.1423 0.1532 0.1416 0.1552 0.1537 0.1589 0.1971 0.1949
va: 1.2525 1.1166 1.1167 1.1614 1.1559 1.1530 1.9647 2.0353 3.3924 2.9711 3.0534 3.2165 3.7303 3.5389 3.9435 3.8983 3.6141 4.0564 3.9747 3.8679 3.5028 3.9786 4.2395 3.7341 3.8576 3.9555 4.4634 3.8952 3.9310 3.8111 4.4087 1.0104 1.0008 0.9872 1.0140 1.0069 0.9970 1.0050 1.0028 1.0199 0.9965 0.9963 0.9907 1.0151 1.0028
dispcorr: -0.026317191 hartree
energy: -2061.602796791652
dipole: -32.29305 33.40775 1.11470 9.11416 -7.21575 1.89841 5.26311 -4.21973 1.04338
magnitude: 2.43622 au
magnitude: 6.19239 debye
