program: Orca
programVersion: 5.0.2
elementType: Cl F F F F F O O N N N N C C C C C C C C C C C C C C C C C C C H H H H H H H H H H H H H H
charge: 0
multiplicity: 1
keywords: wb97x-d3
keywords: def2-TZVPP
keywords: def2/J RIJCOSX
keywords: DEFGRID2
keywords: scfconv7
keywords: smallprint printgap noloewdin
keywords: NOSOSCF
formula: C19H14ClF5N4O2
InChI: InChI=1/C19H14ClF5N4O2/c20-14-7-6-13(8-12(14)9-31-10-18(21,22)19(23,24)25)29-17(11-4-2-1-3-5-11)27-16(28-29)15(26)30/h1-8H,9-10,26H2
45 atoms
Cl 1.907993 -0.981739 2.89591
F  5.597187 -2.41464 -1.541288
F  4.293051 -0.762144 -2.122933
F  5.542259 -1.371926 1.081636
F  4.480847 0.337091 0.301061
F  6.42502 -0.164909 -0.468502
O  2.447207 -1.5405 -0.199438
O  -6.653099 -0.370734 -2.584869
N  -2.979861 0.14525 -0.197141
N  -3.656586 -0.855772 -0.753964
N  -4.684515 1.08362 -1.158293
N  -5.544137 -2.299578 -2.165184
C  -1.813738 -0.124368 0.557403
C  0.290486 -1.285267 0.745049
C  -0.864895 -0.989435 0.035896
C  1.28626 -2.248899 0.177894
C  -3.601799 1.320657 -0.457101
C  -1.630584 0.459798 1.799883
C  0.479761 -0.662056 1.976915
C  3.451789 -2.39982 -0.646441
C  -3.131391 2.64429 -0.046374
C  -0.468508 0.198842 2.505081
C  4.635719 -1.572351 -1.094996
C  -4.671709 -0.251367 -1.317535
C  -1.786944 3.001109 -0.142519
C  -4.059261 3.571912 0.422502
C  5.279129 -0.673159 -0.021511
C  -1.37581 4.264084 0.250978
C  -3.641251 4.833061 0.817347
C  -2.299553 5.179585 0.737748
C  -5.721438 -0.977809 -2.083343
H  -1.02167 -1.441941 -0.935203
H  1.52819 -3.022411 0.917822
H  0.849668 -2.760141 -0.687823
H  -2.381361 1.109152 2.229249
H  3.773751 -3.102073 0.132847
H  3.127444 -3.000526 -1.508033
H  -0.315063 0.656983 3.4725
H  -1.0590 2.304088 -0.536991
H  -5.105351 3.302231 0.490006
H  -0.331095 4.534437 0.171815
H  -4.365774 5.545195 1.189969
H  -1.974059 6.163508 1.049658
H  -4.753524 -2.759237 -1.743954
H  -6.201853 -2.865016 -2.678223
elementType: Cl F O N C H
totalener: -2061.57630508 hartree
nucrepener: 3228.73528423 hartree
electener: -5290.31158932 hartree
oneelecener: -9254.99856142 hartree
twoeener: 3964.68697210 hartree
cpcmener: -0.04824451 hartree
kineticenergy: 2054.88968992 hartree
xcener: -164.585836312649 hartree
chargesum: -0.0000000
charge: -0.073709 -0.186027 -0.186686 -0.165179 -0.156606 -0.160079 -0.337199 -0.485085 0.171901 -0.346439 -0.379556 -0.223911 0.028588 -0.037728 -0.091987 0.026904 0.470361 -0.166393 0.055732 -0.025106 -0.149981 -0.116313 0.334787 0.266624 -0.195924 -0.169148 0.460707 -0.164737 -0.190488 -0.110495 0.241304 0.137261 0.112277 0.101179 0.167035 0.117064 0.118790 0.144571 0.158515 0.142583 0.157428 0.156556 0.159726 0.196459 0.192426
qa: -0.0737 -0.1860 -0.1867 -0.1652 -0.1566 -0.1601 -0.3372 -0.4851 0.1719 -0.3464 -0.3796 -0.2239 0.0286 -0.0377 -0.0920 0.0269 0.4704 -0.1664 0.0557 -0.0251 -0.1500 -0.1163 0.3348 0.2666 -0.1959 -0.1691 0.4607 -0.1647 -0.1905 -0.1105 0.2413 0.1373 0.1123 0.1012 0.1670 0.1171 0.1188 0.1446 0.1585 0.1426 0.1574 0.1566 0.1597 0.1965 0.1924
va: 1.2521 1.1212 1.1239 1.1515 1.1602 1.1550 1.9583 2.0386 3.3634 2.8826 3.1114 3.2191 3.7522 3.7802 3.9736 3.9171 3.6295 3.9819 3.9144 3.9200 3.4906 3.9944 4.2445 3.7549 3.8937 3.9789 4.4388 3.9205 3.9549 3.8761 4.3902 1.0231 0.9900 1.0001 0.9876 1.0065 1.0033 1.0058 0.9992 1.0217 0.9942 0.9948 0.9893 1.0109 1.0049
dispcorr: -0.022249924 hartree
energy: -2061.598555007166
dipole: -44.38143 45.70909 1.32766 9.69701 -11.45380 -1.75679 0.09105 1.54519 1.63625
magnitude: 2.74341 au
magnitude: 6.97319 debye
