program: Orca
programVersion: 5.0.2
elementType: Cl F F F F F O O N N N N C C C C C C C C C C C C C C C C C C C H H H H H H H H H H H H H H
charge: 0
multiplicity: 1
keywords: wb97x-d3
keywords: def2-TZVPP
keywords: def2/J RIJCOSX
keywords: DEFGRID2
keywords: scfconv7
keywords: smallprint printgap noloewdin
keywords: NOSOSCF
formula: C19H14ClF5N4O2
InChI: InChI=1/C19H14ClF5N4O2/c20-14-7-6-13(8-12(14)9-31-10-18(21,22)19(23,24)25)29-17(11-4-2-1-3-5-11)27-16(28-29)15(26)30/h1-8H,9-10,26H2
45 atoms
Cl 1.124883 -4.366708 1.355246
F  3.806355 1.808635 0.644714
F  4.386266 -0.280665 0.359222
F  3.633691 2.07519 -2.108375
F  4.360854 0.058383 -2.329349
F  5.559289 1.525907 -1.315783
O  1.951638 -0.732356 -1.044704
O  -6.710016 -0.411565 -1.427571
N  -2.901107 -0.283491 0.020266
N  -4.101995 -0.637768 -0.430613
N  -3.917625 1.587412 -0.373761
N  -6.509414 1.845569 -1.350459
C  -1.936035 -1.272744 0.328375
C  0.320791 -2.091056 0.13183
C  -0.65665 -1.15965 -0.191326
C  1.728423 -1.95994 -0.397828
C  -2.797039 1.065123 0.066067
C  -2.289968 -2.338379 1.138149
C  -0.049031 -3.159608 0.944616
C  2.180055 0.368814 -0.208171
C  -1.643319 1.828168 0.546528
C  -1.336823 -3.296165 1.436658
C  3.656259 0.73265 -0.164679
C  -4.678586 0.513965 -0.659113
C  -1.248729 2.959451 -0.165095
C  -0.96623 1.476384 1.713784
C  4.312981 1.099548 -1.508909
C  -0.178774 3.721578 0.277601
C  0.098625 2.246684 2.154935
C  0.498464 3.365794 1.436236
C  -6.066276 0.597011 -1.186593
H  -0.42279 -0.341809 -0.859353
H  2.44417 -2.123738 0.414075
H  1.916224 -2.738183 -1.142096
H  -3.291731 -2.426933 1.536395
H  1.613998 1.226432 -0.579219
H  1.859156 0.195524 0.825517
H  -1.596842 -4.138276 2.063352
H  -1.774147 3.239504 -1.06905
H  -1.278137 0.61656 2.293154
H  0.125474 4.594835 -0.284493
H  0.614991 1.972126 3.065548
H  1.331931 3.962978 1.782682
H  -5.933543 2.641235 -1.128576
H  -7.440082 2.011625 -1.698936
elementType: Cl F O N C H
totalener: -2061.57671387 hartree
nucrepener: 3354.23771834 hartree
electener: -5415.81443221 hartree
oneelecener: -9504.82838247 hartree
twoeener: 4089.01395026 hartree
cpcmener: -0.04314443 hartree
kineticenergy: 2054.86394248 hartree
xcener: -164.585586957441 hartree
chargesum: 0.0000000
charge: -0.078541 -0.186532 -0.191032 -0.163074 -0.155919 -0.160125 -0.375662 -0.488569 0.168826 -0.303278 -0.415567 -0.224581 0.057873 0.081488 -0.184578 0.031508 0.469900 -0.194839 -0.008823 -0.029609 -0.142635 -0.100785 0.346357 0.268725 -0.161119 -0.177128 0.457078 -0.194196 -0.196328 -0.106121 0.237443 0.155949 0.112217 0.131005 0.150295 0.133711 0.133798 0.142999 0.142280 0.155226 0.154461 0.156388 0.159907 0.197034 0.194573
qa: -0.0785 -0.1865 -0.1910 -0.1631 -0.1559 -0.1601 -0.3757 -0.4886 0.1688 -0.3033 -0.4156 -0.2246 0.0579 0.0815 -0.1846 0.0315 0.4699 -0.1948 -0.0088 -0.0296 -0.1426 -0.1008 0.3464 0.2687 -0.1611 -0.1771 0.4571 -0.1942 -0.1963 -0.1061 0.2374 0.1559 0.1122 0.1310 0.1503 0.1337 0.1338 0.1430 0.1423 0.1552 0.1545 0.1564 0.1599 0.1970 0.1946
va: 1.2525 1.1176 1.1149 1.1526 1.1615 1.1553 1.9648 2.0357 3.3928 2.9711 3.0507 3.2153 3.7324 3.5302 3.9463 3.9015 3.6251 4.0549 3.9790 3.8709 3.5011 3.9796 4.2389 3.7335 3.9618 3.8578 4.4619 3.9427 3.8929 3.8232 4.4095 1.0132 1.0005 0.9877 1.0134 1.0076 0.9976 1.0048 1.0211 1.0012 0.9960 0.9964 0.9898 1.0155 1.0030
dispcorr: -0.025974380 hartree
energy: -2061.602688245648
dipole: -32.73828 33.87796 1.13968 8.80230 -7.06202 1.74028 8.02429 -6.56428 1.46001
magnitude: 2.54147 au
magnitude: 6.45990 debye
