program: Orca
programVersion: 5.0.2
elementType: Cl F F F F F O O N N N N C C C C C C C C C C C C C C C C C C C H H H H H H H H H H H H H H
charge: 0
multiplicity: 1
keywords: wb97x-d3
keywords: def2-TZVPP
keywords: def2/J RIJCOSX
keywords: DEFGRID2
keywords: scfconv7
keywords: smallprint printgap noloewdin
keywords: NOSOSCF
formula: C19H14ClF5N4O2
InChI: InChI=1/C19H14ClF5N4O2/c20-14-7-6-13(8-12(14)9-31-10-18(21,22)19(23,24)25)29-17(11-4-2-1-3-5-11)27-16(28-29)15(26)30/h1-8H,9-10,26H2
45 atoms
Cl 1.188718 -4.937061 0.835186
F  2.065425 1.697668 -0.429889
F  4.201928 1.330345 -0.24145
F  2.210816 1.236275 -3.113231
F  4.325043 0.840206 -2.9579
F  3.551158 2.776704 -2.418801
O  2.638233 -0.765917 0.533175
O  -5.486069 2.4259 -1.340141
N  -2.345358 -0.268947 0.18817
N  -3.340234 -0.318232 -0.693357
N  -3.278519 1.689533 0.277649
N  -5.528862 0.3467 -2.237317
C  -1.486004 -1.383424 0.339551
C  0.734586 -2.278545 0.610872
C  -0.11805 -1.193348 0.459361
C  2.22089 -2.081018 0.792393
C  -2.320652 0.949617 0.781515
C  -2.032754 -2.65669 0.345792
C  0.170252 -3.5509 0.625129
C  2.831312 -0.498216 -0.828761
C  -1.38461 1.37327 1.825138
C  -1.193627 -3.747458 0.484398
C  3.09794 0.987932 -0.943208
C  -3.872612 0.873913 -0.610645
C  -0.751559 2.606931 1.697252
C  -1.132617 0.577959 2.941526
C  3.301849 1.472345 -2.388539
C  0.141476 3.032172 2.668169
C  -0.2427 1.010737 3.911198
C  0.399866 2.234119 3.773917
C  -5.040675 1.293928 -1.431402
H  0.291225 -0.193715 0.429403
H  2.485167 -2.290867 1.832224
H  2.778013 -2.795306 0.174723
H  -3.099652 -2.803749 0.247962
H  3.68549 -1.058511 -1.228283
H  1.956256 -0.756987 -1.436696
H  -1.607005 -4.746787 0.49242
H  -0.949909 3.228403 0.833633
H  -1.637194 -0.372059 3.063021
H  0.637558 3.987504 2.558733
H  -0.053967 0.391344 4.778046
H  1.098524 2.56632 4.530803
H  -5.118947 -0.571385 -2.28789
H  -6.311117 0.5504 -2.838804
elementType: Cl F O N C H
totalener: -2061.57579251 hartree
nucrepener: 3361.95370773 hartree
electener: -5423.52950024 hartree
oneelecener: -9521.09796991 hartree
twoeener: 4097.56846967 hartree
cpcmener: -0.04726132 hartree
kineticenergy: 2054.87514902 hartree
xcener: -164.588083409423 hartree
chargesum: 0.0000000
charge: -0.079259 -0.182632 -0.184279 -0.159372 -0.160410 -0.155275 -0.354304 -0.485352 0.168160 -0.344368 -0.378149 -0.224315 0.091797 0.100286 -0.219164 0.008896 0.485463 -0.196126 -0.022323 -0.073312 -0.152170 -0.104388 0.355164 0.266094 -0.197804 -0.171951 0.448114 -0.190337 -0.181248 -0.099900 0.240618 0.170321 0.133803 0.115585 0.147758 0.148141 0.135376 0.142245 0.142118 0.154510 0.156095 0.156558 0.159971 0.197038 0.192324
qa: -0.0793 -0.1826 -0.1843 -0.1594 -0.1604 -0.1553 -0.3543 -0.4854 0.1682 -0.3444 -0.3781 -0.2243 0.0918 0.1003 -0.2192 0.0089 0.4855 -0.1961 -0.0223 -0.0733 -0.1522 -0.1044 0.3552 0.2661 -0.1978 -0.1720 0.4481 -0.1903 -0.1812 -0.0999 0.2406 0.1703 0.1338 0.1156 0.1478 0.1481 0.1354 0.1422 0.1421 0.1545 0.1561 0.1566 0.1600 0.1970 0.1923
va: 1.2517 1.1136 1.1232 1.1580 1.1560 1.1656 1.9561 2.0385 3.3714 2.8823 3.1098 3.2194 3.7181 3.5084 3.9330 3.9246 3.6045 4.0511 3.9785 3.8978 3.4739 3.9915 4.2250 3.7545 3.9650 3.8857 4.4464 3.9540 3.9295 3.8673 4.3891 0.9976 0.9863 0.9934 1.0166 1.0096 0.9938 1.0054 1.0202 1.0022 0.9948 0.9943 0.9886 1.0104 1.0050
dispcorr: -0.023988685 hartree
energy: -2061.599781194900
dipole: -22.63899 24.06651 1.42753 -5.28460 1.61554 -3.66905 17.79898 -17.73245 0.06653
magnitude: 3.93754 au
magnitude: 10.00842 debye
