program: Orca
programVersion: 5.0.2
elementType: Cl F F F F F O O N N N N C C C C C C C C C C C C C C C C C C C H H H H H H H H H H H H H H
charge: 0
multiplicity: 1
keywords: wb97x-d3
keywords: def2-TZVPP
keywords: def2/J RIJCOSX
keywords: DEFGRID2
keywords: scfconv7
keywords: smallprint printgap noloewdin
keywords: NOSOSCF
formula: C19H14ClF5N4O2
InChI: InChI=1/C19H14ClF5N4O2/c20-14-7-6-13(8-12(14)9-31-10-18(21,22)19(23,24)25)29-17(11-4-2-1-3-5-11)27-16(28-29)15(26)30/h1-8H,9-10,26H2
45 atoms
Cl 1.532222 -4.081951 -1.423872
F  1.673762 1.033847 1.494878
F  3.410219 0.498337 2.692654
F  3.249249 1.360791 -0.691831
F  4.988026 0.74227 0.420587
F  3.90522 2.509225 1.007807
O  1.846645 -1.615911 1.918093
O  -5.832804 0.048832 2.391895
N  -2.615316 -0.105874 -0.105956
N  -3.563275 -0.344424 0.796719
N  -3.893163 1.638909 -0.179815
N  -6.199527 2.017317 1.328827
C  -1.632021 -1.08303 -0.401775
C  0.241568 -2.423919 0.308334
C  -0.748884 -1.483514 0.581126
C  1.206791 -2.769673 1.414574
C  -2.811348 1.098197 -0.688304
C  -1.5629 -1.61209 -1.681674
C  0.311379 -2.93239 -0.985342
C  2.733527 -1.016853 1.014865
C  -1.947818 1.699373 -1.704246
C  -0.584325 -2.541934 -1.972419
C  2.883751 0.426115 1.448658
C  -4.311193 0.726891 0.718537
C  -2.535829 2.381931 -2.767275
C  -0.558002 1.631799 -1.611373
C  3.775818 1.277758 0.528805
C  -1.742294 2.973237 -3.737188
C  0.229524 2.22881 -2.582536
C  -0.359186 2.894754 -3.648714
C  -5.520837 0.892875 1.56694
H  -0.822735 -1.056075 1.573761
H  0.659458 -3.196615 2.25609
H  1.937522 -3.516581 1.094011
H  -2.264831 -1.306882 -2.446304
H  3.711314 -1.512775 1.021386
H  2.362712 -1.036735 -0.016383
H  -0.517423 -2.959595 -2.967467
H  -3.614108 2.441802 -2.839245
H  -0.083495 1.142124 -0.770981
H  -2.205203 3.49511 -4.564321
H  1.306728 2.181292 -2.500485
H  0.260365 3.355707 -4.407032
H  -5.892453 2.681722 0.636987
H  -7.029122 2.230742 1.85926
elementType: Cl F O N C H
totalener: -2061.57452325 hartree
nucrepener: 3370.40917617 hartree
electener: -5431.98369942 hartree
oneelecener: -9537.76640501 hartree
twoeener: 4105.78270559 hartree
cpcmener: -0.04511878 hartree
kineticenergy: 2054.88591876 hartree
xcener: -164.585670161770 hartree
chargesum: -0.0000000
charge: -0.077009 -0.184923 -0.184857 -0.158428 -0.159915 -0.155963 -0.346914 -0.489381 0.175387 -0.300528 -0.417086 -0.223916 0.017483 -0.032204 -0.167211 0.060323 0.457997 -0.176512 0.082254 -0.048424 -0.111408 -0.090844 0.348473 0.264692 -0.189181 -0.207824 0.449693 -0.178385 -0.153542 -0.119482 0.237489 0.136449 0.123050 0.106565 0.159785 0.143441 0.114436 0.142820 0.141041 0.148981 0.156226 0.154802 0.160779 0.197571 0.194200
qa: -0.0770 -0.1849 -0.1849 -0.1584 -0.1599 -0.1560 -0.3469 -0.4894 0.1754 -0.3005 -0.4171 -0.2239 0.0175 -0.0322 -0.1672 0.0603 0.4580 -0.1765 0.0823 -0.0484 -0.1114 -0.0908 0.3485 0.2647 -0.1892 -0.2078 0.4497 -0.1784 -0.1535 -0.1195 0.2375 0.1364 0.1231 0.1066 0.1598 0.1434 0.1144 0.1428 0.1410 0.1490 0.1562 0.1548 0.1608 0.1976 0.1942
va: 1.2463 1.1076 1.1226 1.1516 1.1565 1.1633 1.9509 2.0351 3.3667 2.9656 3.0516 3.2152 3.7234 3.6556 4.0025 3.8699 3.6273 3.9948 3.8397 3.9359 3.5077 3.9621 4.2378 3.7404 3.9799 3.9370 4.4301 3.9499 3.8956 3.8989 4.4095 1.0323 0.9936 1.0111 0.9965 1.0073 1.0007 1.0060 1.0227 0.9982 0.9946 1.0048 0.9898 1.0150 1.0032
dispcorr: -0.024918844 hartree
energy: -2061.599442091817
dipole: -28.38739 29.69268 1.30529 2.17748 -1.74203 0.43545 -13.19884 10.12832 -3.07051
magnitude: 3.36474 au
magnitude: 8.55248 debye
