program: Orca
programVersion: 5.0.2
elementType: Cl F F F F F O O N N N N C C C C C C C C C C C C C C C C C C C H H H H H H H H H H H H H H
charge: 0
multiplicity: 1
keywords: wb97x-d3
keywords: def2-TZVPP
keywords: def2/J RIJCOSX
keywords: DEFGRID2
keywords: scfconv7
keywords: smallprint printgap noloewdin
keywords: NOSOSCF
formula: C19H14ClF5N4O2
InChI: InChI=1/C19H14ClF5N4O2/c20-14-7-6-13(8-12(14)9-31-10-18(21,22)19(23,24)25)29-17(11-4-2-1-3-5-11)27-16(28-29)15(26)30/h1-8H,9-10,26H2
45 atoms
Cl 2.163464 -3.199355 -0.342903
F  5.072676 0.995536 1.455934
F  3.555756 1.48504 2.942502
F  4.590212 -1.627562 1.728558
F  2.862391 -1.251443 2.965326
F  4.828089 -0.692121 3.649506
O  3.125496 -0.173779 -0.142018
O  -6.376277 2.204605 0.874838
N  -2.672247 0.16979 -0.378875
N  -3.486338 0.162874 0.673544
N  -4.224125 1.609523 -0.858874
N  -5.582487 0.717715 2.38967
C  -1.503298 -0.627831 -0.369154
C  0.867987 -0.852302 -0.748177
C  -0.284591 -0.07796 -0.733612
C  2.173377 -0.237329 -1.17814
C  -3.131129 1.040853 -1.309901
C  -1.592273 -1.952294 0.024822
C  0.765472 -2.182285 -0.344179
C  2.796678 0.72536 0.875555
C  -2.52852 1.298635 -2.619064
C  -0.447095 -2.72973 0.044388
C  3.865121 0.627685 1.942177
C  -4.401105 1.040838 0.346372
C  -2.040687 0.265729 -3.41871
C  -2.482685 2.611178 -3.085196
C  4.041627 -0.767592 2.576881
C  -1.499302 0.549465 -4.662405
C  -1.935834 2.889011 -4.328191
C  -1.440748 1.859971 -5.117504
C  -5.549834 1.379789 1.229359
H  -0.215939 0.966918 -1.008979
H  2.628525 -0.832652 -1.971465
H  1.980155 0.759417 -1.592474
H  -2.542473 -2.383574 0.310091
H  2.770609 1.764157 0.516262
H  1.820706 0.516935 1.330998
H  -0.508822 -3.765152 0.350074
H  -2.09965 -0.763377 -3.088487
H  -2.866126 3.415764 -2.471054
H  -1.129111 -0.257819 -5.280622
H  -1.896216 3.911694 -4.679844
H  -1.014357 2.078036 -6.088192
H  -4.878665 0.041046 2.637432
H  -6.328728 0.887189 3.046279
elementType: Cl F O N C H
totalener: -2061.57510007 hartree
nucrepener: 3299.14355984 hartree
electener: -5360.71865991 hartree
oneelecener: -9395.18632477 hartree
twoeener: 4034.46766487 hartree
cpcmener: -0.04839482 hartree
kineticenergy: 2054.87119627 hartree
xcener: -164.583852744457 hartree
chargesum: -0.0000000
charge: -0.072407 -0.187287 -0.186685 -0.154868 -0.166463 -0.161358 -0.335524 -0.485704 0.174632 -0.346697 -0.378833 -0.224666 0.038871 -0.025736 -0.097150 0.024079 0.465695 -0.169187 0.032310 -0.035975 -0.150724 -0.128609 0.341077 0.267025 -0.187279 -0.171513 0.462793 -0.173595 -0.190656 -0.108812 0.242311 0.155034 0.125892 0.108364 0.150650 0.124709 0.115365 0.142418 0.159285 0.143205 0.157868 0.157108 0.160735 0.197200 0.193101
qa: -0.0724 -0.1873 -0.1867 -0.1549 -0.1665 -0.1614 -0.3355 -0.4857 0.1746 -0.3467 -0.3788 -0.2247 0.0389 -0.0257 -0.0971 0.0241 0.4657 -0.1692 0.0323 -0.0360 -0.1507 -0.1286 0.3411 0.2670 -0.1873 -0.1715 0.4628 -0.1736 -0.1907 -0.1088 0.2423 0.1550 0.1259 0.1084 0.1506 0.1247 0.1154 0.1424 0.1593 0.1432 0.1579 0.1571 0.1607 0.1972 0.1931
va: 1.2521 1.1247 1.1205 1.1629 1.1472 1.1534 1.9651 2.0379 3.3619 2.8823 3.1124 3.2199 3.7304 3.5628 3.8203 3.9072 3.6415 4.0474 3.9142 3.9323 3.4914 4.0244 4.2531 3.7539 3.8894 3.9801 4.4314 3.9250 3.9578 3.8751 4.3896 0.9965 0.9927 0.9990 1.0124 1.0057 1.0000 1.0069 0.9992 1.0223 0.9942 0.9947 0.9888 1.0104 1.0045
dispcorr: -0.023681682 hartree
energy: -2061.598781753983
dipole: -35.99512 36.84385 0.84873 11.29006 -12.50361 -1.21355 -28.17649 27.25763 -0.91886
magnitude: 1.74280 au
magnitude: 4.42984 debye
