program: Orca
programVersion: 5.0.2
elementType: Cl F F F F F O O N N N N C C C C C C C C C C C C C C C C C C C H H H H H H H H H H H H H H
charge: 0
multiplicity: 1
keywords: wb97x-d3
keywords: def2-TZVPP
keywords: def2/J RIJCOSX
keywords: DEFGRID2
keywords: scfconv7
keywords: smallprint printgap noloewdin
keywords: NOSOSCF
formula: C19H14ClF5N4O2
InChI: InChI=1/C19H14ClF5N4O2/c20-14-7-6-13(8-12(14)9-31-10-18(21,22)19(23,24)25)29-17(11-4-2-1-3-5-11)27-16(28-29)15(26)30/h1-8H,9-10,26H2
45 atoms
Cl 1.243879 -4.590281 -0.022775
F  2.693798 1.956782 0.895966
F  4.788095 1.522157 1.354096
F  4.844609 -0.348756 -0.607579
F  4.221238 1.602899 -1.278986
F  2.777755 0.021953 -1.085185
O  1.909911 -0.544122 1.598859
O  -6.526467 1.890298 0.586911
N  -2.719139 -0.235543 -0.068312
N  -3.973193 -0.544962 0.255161
N  -3.784055 1.656243 -0.053115
N  -6.67787 -0.359333 0.807245
C  -1.738759 -1.257739 -0.089567
C  0.439507 -2.069061 0.537349
C  -0.511137 -1.05585 0.522322
C  1.780922 -1.881814 1.187739
C  -2.614425 1.101081 -0.264182
C  -2.05158 -2.467282 -0.688129
C  0.104068 -3.285907 -0.050854
C  3.206153 -0.112749 1.894065
C  -1.41264 1.833205 -0.667734
C  -1.121556 -3.490522 -0.66068
C  3.626243 0.97717 0.919492
C  -4.576767 0.616196 0.254941
C  -1.130942 3.042507 -0.034902
C  -0.588159 1.383883 -1.697188
C  3.867617 0.553749 -0.540956
C  -0.024657 3.784923 -0.415271
C  0.51154 2.136565 -2.079864
C  0.799594 3.332555 -1.436516
C  -6.022367 0.779605 0.56624
H  -0.298444 -0.113263 1.006103
H  1.873672 -2.558875 2.046871
H  2.570767 -2.163841 0.482804
H  -3.009037 -2.619368 -1.167073
H  3.224612 0.331846 2.894799
H  3.942094 -0.922229 1.889863
H  -1.353458 -4.442814 -1.117561
H  -1.77415 3.397857 0.759815
H  -0.812366 0.461918 -2.218693
H  0.192331 4.718413 0.087405
H  1.13878 1.792244 -2.891145
H  1.6604 3.915786 -1.736874
H  -6.218557 -1.254815 0.775963
H  -7.661319 -0.338968 1.026605
elementType: Cl F O N C H
totalener: -2061.57437672 hartree
nucrepener: 3410.37061597 hartree
electener: -5471.94499269 hartree
oneelecener: -9618.47531928 hartree
twoeener: 4146.53032659 hartree
cpcmener: -0.04614207 hartree
kineticenergy: 2054.86648798 hartree
xcener: -164.585467823282 hartree
chargesum: -0.0000000
charge: -0.078861 -0.182443 -0.186953 -0.164984 -0.163513 -0.161542 -0.345553 -0.485332 0.172691 -0.346214 -0.379107 -0.224384 0.041499 0.110044 -0.140029 -0.010192 0.479095 -0.193090 -0.003140 -0.033960 -0.168252 -0.113203 0.341803 0.265919 -0.159321 -0.161534 0.475607 -0.196769 -0.201555 -0.107509 0.241272 0.156588 0.133242 0.104204 0.148252 0.125139 0.116699 0.142747 0.141809 0.156048 0.153911 0.153351 0.158159 0.196992 0.192368
qa: -0.0789 -0.1824 -0.1870 -0.1650 -0.1635 -0.1615 -0.3456 -0.4853 0.1727 -0.3462 -0.3791 -0.2244 0.0415 0.1100 -0.1400 -0.0102 0.4791 -0.1931 -0.0031 -0.0340 -0.1683 -0.1132 0.3418 0.2659 -0.1593 -0.1615 0.4756 -0.1968 -0.2016 -0.1075 0.2413 0.1566 0.1332 0.1042 0.1483 0.1251 0.1167 0.1427 0.1418 0.1560 0.1539 0.1534 0.1582 0.1970 0.1924
va: 1.2534 1.1205 1.1229 1.1532 1.1513 1.1440 1.9600 2.0388 3.3646 2.8849 3.1097 3.2191 3.7549 3.5369 3.9136 3.9191 3.6152 4.0555 3.9792 3.9469 3.4854 4.0032 4.2228 3.7559 3.9713 3.8631 4.3840 3.9550 3.8886 3.8241 4.3913 1.0217 0.9878 0.9905 1.0147 1.0054 1.0032 1.0051 1.0218 1.0013 0.9953 1.0009 0.9901 1.0104 1.0050
dispcorr: -0.025748512 hartree
energy: -2061.600125232560
dipole: -25.87429 28.10416 2.22987 1.91213 -5.04567 -3.13354 2.42233 -2.00142 0.42090
magnitude: 3.86892 au
magnitude: 9.83401 debye
