program: Orca
programVersion: 5.0.2
elementType: Cl F F F F F O O N N N N C C C C C C C C C C C C C C C C C C C H H H H H H H H H H H H H H
charge: 0
multiplicity: 1
keywords: wb97x-d3
keywords: def2-TZVPP
keywords: def2/J RIJCOSX
keywords: DEFGRID2
keywords: scfconv7
keywords: smallprint printgap noloewdin
keywords: NOSOSCF
formula: C19H14ClF5N4O2
InChI: InChI=1/C19H14ClF5N4O2/c20-14-7-6-13(8-12(14)9-31-10-18(21,22)19(23,24)25)29-17(11-4-2-1-3-5-11)27-16(28-29)15(26)30/h1-8H,9-10,26H2
45 atoms
Cl 1.376795 -4.307168 0.050345
F  3.977726 -0.426801 -0.826022
F  3.905064 1.746709 -0.820056
F  4.348019 1.620066 1.976891
F  5.890828 0.885103 0.663759
F  4.661453 -0.50317 1.746811
O  1.877232 -0.138172 1.431152
O  -6.900923 -0.491971 0.700931
N  -2.918288 -0.282758 -0.123554
N  -4.152906 -0.64757 0.21373
N  -4.099259 1.523998 -0.303473
N  -6.836575 1.718913 0.202712
C  -1.871375 -1.235071 -0.083806
C  0.372016 -1.840344 0.549638
C  -0.666053 -0.916969 0.521646
C  1.696078 -1.514026 1.19552
C  -2.891807 1.030637 -0.44923
C  -2.087979 -2.486517 -0.637029
C  0.136011 -3.097453 -0.000727
C  2.178841 0.65734 0.318805
C  -1.725753 1.782848 -0.918972
C  -1.077366 -3.428056 -0.580964
C  3.657017 0.649837 -0.064756
C  -4.830213 0.464806 0.093596
C  -0.898976 1.289726 -1.926938
C  -1.475735 3.04058 -0.374577
C  4.655902 0.662223 1.107652
C  0.171177 2.047891 -2.376559
C  -0.399225 3.790138 -0.822514
C  0.427107 3.295021 -1.822248
C  -6.292145 0.510883 0.363345
H  -0.536028 0.052051 0.985366
H  1.750014 -1.995215 2.175317
H  2.507963 -1.938225 0.599162
H  -3.031123 -2.7330 -1.105042
H  1.607571 0.382002 -0.575762
H  1.902126 1.681023 0.576895
H  -1.234396 -4.413138 -0.998342
H  -1.096856 0.325126 -2.377046
H  -2.119054 3.429949 0.403914
H  0.804383 1.663519 -3.165477
H  -0.207758 4.7633 -0.38977
H  1.264441 3.883355 -2.174573
H  -6.286417 2.510389 -0.088924
H  -7.823777 1.855685 0.352257
elementType: Cl F O N C H
totalener: -2061.57508273 hartree
nucrepener: 3357.51475432 hartree
electener: -5419.08983705 hartree
oneelecener: -9511.45017928 hartree
twoeener: 4092.36034223 hartree
cpcmener: -0.04235443 hartree
kineticenergy: 2054.85733610 hartree
xcener: -164.584007440163 hartree
chargesum: 0.0000000
charge: -0.079405 -0.191867 -0.186978 -0.160049 -0.159178 -0.157256 -0.369611 -0.489077 0.169120 -0.305009 -0.414157 -0.223814 0.072644 0.092085 -0.203282 0.023236 0.470069 -0.193637 -0.009090 -0.021038 -0.149019 -0.105659 0.319871 0.268380 -0.173412 -0.158848 0.464059 -0.206742 -0.198709 -0.098866 0.237577 0.159010 0.135039 0.110846 0.149946 0.123732 0.149766 0.143342 0.156014 0.144037 0.157282 0.156034 0.160627 0.197249 0.194736
qa: -0.0794 -0.1919 -0.1870 -0.1600 -0.1592 -0.1573 -0.3696 -0.4891 0.1691 -0.3050 -0.4142 -0.2238 0.0726 0.0921 -0.2033 0.0232 0.4701 -0.1936 -0.0091 -0.0210 -0.1490 -0.1057 0.3199 0.2684 -0.1734 -0.1588 0.4641 -0.2067 -0.1987 -0.0989 0.2376 0.1590 0.1350 0.1108 0.1499 0.1237 0.1498 0.1433 0.1560 0.1440 0.1573 0.1560 0.1606 0.1972 0.1947
va: 1.2514 1.1041 1.1155 1.1580 1.1557 1.1562 1.9601 2.0351 3.3894 2.9670 3.0512 3.2162 3.7251 3.5310 3.9406 3.8755 3.6251 4.0530 3.9746 3.8441 3.4942 3.9910 4.1879 3.7348 3.8445 3.9591 4.4616 3.8962 3.9459 3.8280 4.4076 1.0140 0.9864 1.0068 1.0153 1.0184 1.0067 1.0051 1.0016 1.0189 0.9966 0.9951 0.9894 1.0150 1.0028
dispcorr: -0.026100133 hartree
energy: -2061.601182865044
dipole: -34.93916 36.02901 1.08985 11.60771 -9.76696 1.84075 -8.17338 6.95033 -1.22305
magnitude: 2.46413 au
magnitude: 6.26333 debye
