program: Orca
programVersion: 5.0.2
elementType: Cl F F F F F O O N N N N C C C C C C C C C C C C C C C C C C C H H H H H H H H H H H H H H
charge: 0
multiplicity: 1
keywords: wb97x-d3
keywords: def2-TZVPP
keywords: def2/J RIJCOSX
keywords: DEFGRID2
keywords: scfconv7
keywords: smallprint printgap noloewdin
keywords: NOSOSCF
formula: C19H14ClF5N4O2
InChI: InChI=1/C19H14ClF5N4O2/c20-14-7-6-13(8-12(14)9-31-10-18(21,22)19(23,24)25)29-17(11-4-2-1-3-5-11)27-16(28-29)15(26)30/h1-8H,9-10,26H2
45 atoms
Cl 1.592204 -4.202144 -1.936535
F  2.971126 -0.393485 3.581618
F  5.046025 0.11657 3.1285
F  4.057747 1.965983 1.247694
F  3.62136 2.291411 3.334335
F  2.078709 1.584396 2.015301
O  2.511464 -0.990031 0.937878
O  -4.721171 2.769441 1.966676
N  -2.096859 0.106174 -0.366676
N  -2.354718 0.346627 0.91625
N  -3.579972 1.689337 -0.380331
N  -3.395949 1.444968 3.237702
C  -1.216024 -0.939439 -0.737252
C  0.954843 -1.961459 -0.561942
C  0.065968 -0.953661 -0.212099
C  2.354756 -2.001618 -0.02082
C  -2.832369 0.931662 -1.147322
C  -1.648117 -1.921894 -1.611227
C  0.514007 -2.934341 -1.456491
C  3.809682 -0.912221 1.442824
C  -2.784653 0.99513 -2.608541
C  -0.767744 -2.92354 -1.979472
C  3.798342 0.053434 2.60962
C  -3.251376 1.29973 0.863452
C  -1.580568 0.905876 -3.305729
C  -3.972389 1.197423 -3.308832
C  3.375283 1.501276 2.292397
C  -1.572198 1.002818 -4.687956
C  -3.957819 1.289504 -4.691299
C  -2.758991 1.188374 -5.383714
C  -3.86164 1.910484 2.075541
H  0.370204 -0.166488 0.463175
H  2.556652 -2.984586 0.425027
H  3.070706 -1.873456 -0.844291
H  -2.656066 -1.917044 -2.003356
H  4.164476 -1.879963 1.823109
H  4.530543 -0.576166 0.687844
H  -1.086034 -3.69781 -2.663814
H  -0.644712 0.781805 -2.776483
H  -4.907947 1.274568 -2.770187
H  -0.633318 0.940828 -5.22222
H  -4.885421 1.43927 -5.227997
H  -2.748341 1.262955 -6.463359
H  -2.679822 0.739021 3.281368
H  -3.757591 1.807363 4.105511
elementType: Cl F O N C H
totalener: -2061.57728337 hartree
nucrepener: 3266.82931223 hartree
electener: -5328.40659560 hartree
oneelecener: -9331.04335122 hartree
twoeener: 4002.63675562 hartree
cpcmener: -0.04629355 hartree
kineticenergy: 2054.88071402 hartree
xcener: -164.587051359298 hartree
chargesum: 0.0000000
charge: -0.077090 -0.185632 -0.184699 -0.162673 -0.158689 -0.152958 -0.334150 -0.486096 0.180822 -0.344640 -0.380809 -0.222563 -0.006985 0.066679 -0.128887 0.017761 0.460069 -0.174158 0.031533 -0.031519 -0.135247 -0.111303 0.332100 0.263753 -0.198736 -0.172228 0.455833 -0.163127 -0.186742 -0.113516 0.242415 0.147421 0.104272 0.107925 0.161354 0.118093 0.120837 0.142485 0.155529 0.141300 0.156559 0.156667 0.160290 0.197008 0.191742
qa: -0.0771 -0.1856 -0.1847 -0.1627 -0.1587 -0.1530 -0.3342 -0.4861 0.1808 -0.3446 -0.3808 -0.2226 -0.0070 0.0667 -0.1289 0.0178 0.4601 -0.1742 0.0315 -0.0315 -0.1352 -0.1113 0.3321 0.2638 -0.1987 -0.1722 0.4558 -0.1631 -0.1867 -0.1135 0.2424 0.1474 0.1043 0.1079 0.1614 0.1181 0.1208 0.1425 0.1555 0.1413 0.1566 0.1567 0.1603 0.1970 0.1917
va: 1.2543 1.1249 1.1223 1.1538 1.1564 1.1564 1.9891 2.0377 3.3545 2.8839 3.1141 3.2204 3.7842 3.6104 3.9844 3.9571 3.6404 3.9830 3.9695 3.9252 3.4971 3.9921 4.2544 3.7573 3.9020 3.9801 4.4342 3.9158 3.9547 3.8791 4.3923 1.0338 0.9892 0.9849 0.9934 1.0023 1.0055 1.0060 0.9996 1.0236 0.9943 0.9947 0.9892 1.0105 1.0053
dispcorr: -0.022182486 hartree
energy: -2061.599465855957
dipole: -27.51442 30.03790 2.52348 -4.07093 1.07962 -2.99130 -25.66112 24.00339 -1.65773
magnitude: 4.25017 au
magnitude: 10.80306 debye
