program: Orca
programVersion: 5.0.2
elementType: Cl F F F F F O O N N N N C C C C C C C C C C C C C C C C C C C H H H H H H H H H H H H H H
charge: 0
multiplicity: 1
keywords: wb97x-d3
keywords: def2-TZVPP
keywords: def2/J RIJCOSX
keywords: DEFGRID2
keywords: scfconv7
keywords: smallprint printgap noloewdin
keywords: NOSOSCF
formula: C19H14ClF5N4O2
InChI: InChI=1/C19H14ClF5N4O2/c20-14-7-6-13(8-12(14)9-31-10-18(21,22)19(23,24)25)29-17(11-4-2-1-3-5-11)27-16(28-29)15(26)30/h1-8H,9-10,26H2
45 atoms
Cl 1.102563 -4.9745 0.595597
F  4.00285 1.507158 0.610629
F  4.789478 0.254064 -0.998053
F  3.846645 2.794047 -1.649983
F  1.859292 2.14006 -1.144629
F  2.965934 1.136352 -2.701075
O  2.333039 -1.091592 -1.109972
O  -6.281203 0.083106 -1.320371
N  -2.501152 -0.339866 0.139857
N  -3.713948 -0.511704 -0.381625
N  -3.394044 1.63201 0.153023
N  -5.95658 2.25238 -0.743966
C  -1.621393 -1.445256 0.246576
C  0.522799 -2.447964 -0.196421
C  -0.354864 -1.376205 -0.310042
C  1.90001 -2.393238 -0.812514
C  -2.313311 0.958341 0.47273
C  -2.058606 -2.586106 0.898598
C  0.067566 -3.590617 0.456817
C  2.744456 -0.354241 0.008364
C  -1.126265 1.533816 1.10609
C  -1.206253 -3.670223 0.996352
C  3.654826 0.760012 -0.463186
C  -4.214734 0.696361 -0.358404
C  -0.728034 2.81434 0.725362
C  -0.422283 0.864249 2.106792
C  3.067987 1.722864 -1.513702
C  0.371353 3.409332 1.322315
C  0.675375 1.46668 2.702143
C  1.080169 2.734561 2.306352
C  -5.587965 0.974378 -0.856405
H  -0.051456 -0.48521 -0.845092
H  2.624633 -2.89337 -0.159632
H  1.894972 -2.940688 -1.758672
H  -3.04994 -2.632191 1.328959
H  1.905771 0.073936 0.568333
H  3.322697 -0.968953 0.711761
H  -1.53339 -4.570357 1.498585
H  -1.274428 3.340716 -0.046612
H  -0.736122 -0.115029 2.444157
H  0.678132 4.399672 1.012154
H  1.214067 0.942792 3.480904
H  1.939826 3.199232 2.771543
H  -5.340223 2.944723 -0.349928
H  -6.869539 2.547963 -1.052075
elementType: Cl F O N C H
totalener: -2061.57634787 hartree
nucrepener: 3414.50502334 hartree
electener: -5476.08137121 hartree
oneelecener: -9625.75400012 hartree
twoeener: 4149.67262890 hartree
cpcmener: -0.04396718 hartree
kineticenergy: 2054.86964117 hartree
xcener: -164.586870477600 hartree
chargesum: -0.0000000
charge: -0.078558 -0.187980 -0.186416 -0.161054 -0.153385 -0.157988 -0.358997 -0.489858 0.172025 -0.304136 -0.417194 -0.224393 0.061294 0.117031 -0.211251 -0.002092 0.458353 -0.202464 -0.010519 0.016757 -0.115517 -0.093266 0.350178 0.264404 -0.171676 -0.180369 0.454582 -0.193724 -0.180399 -0.106435 0.240652 0.156939 0.110895 0.131722 0.149577 0.073705 0.133989 0.143167 0.138689 0.155210 0.152870 0.154465 0.159192 0.197262 0.194710
qa: -0.0786 -0.1880 -0.1864 -0.1611 -0.1534 -0.1580 -0.3590 -0.4899 0.1720 -0.3041 -0.4172 -0.2244 0.0613 0.1170 -0.2113 -0.0021 0.4584 -0.2025 -0.0105 0.0168 -0.1155 -0.0933 0.3502 0.2644 -0.1717 -0.1804 0.4546 -0.1937 -0.1804 -0.1064 0.2407 0.1569 0.1109 0.1317 0.1496 0.0737 0.1340 0.1432 0.1387 0.1552 0.1529 0.1545 0.1592 0.1973 0.1947
va: 1.2515 1.1141 1.1262 1.1543 1.1478 1.1594 1.9794 2.0340 3.3901 2.9691 3.0521 3.2158 3.7136 3.5010 3.9690 3.9497 3.6452 4.0644 3.9759 3.8716 3.4969 3.9697 4.2527 3.7437 3.9485 3.8369 4.4279 3.9171 3.8685 3.8148 4.4065 1.0165 0.9989 0.9870 1.0128 1.0254 1.0123 1.0049 1.0235 1.0007 0.9956 0.9967 0.9884 1.0150 1.0028
dispcorr: -0.026561849 hartree
energy: -2061.602909718018
dipole: -23.03118 24.70375 1.67257 2.05076 -1.36673 0.68402 14.01854 -11.86263 2.15591
magnitude: 2.81306 au
magnitude: 7.15023 debye
