program: Orca
programVersion: 5.0.2
elementType: Cl F F F F F O O N N N N C C C C C C C C C C C C C C C C C C C H H H H H H H H H H H H H H
charge: 0
multiplicity: 1
keywords: wb97x-d3
keywords: def2-TZVPP
keywords: def2/J RIJCOSX
keywords: DEFGRID2
keywords: scfconv7
keywords: smallprint printgap noloewdin
keywords: NOSOSCF
formula: C19H14ClF5N4O2
InChI: InChI=1/C19H14ClF5N4O2/c20-14-7-6-13(8-12(14)9-31-10-18(21,22)19(23,24)25)29-17(11-4-2-1-3-5-11)27-16(28-29)15(26)30/h1-8H,9-10,26H2
45 atoms
Cl 1.483649 -3.772419 1.061568
F  4.99744 -0.812229 0.510133
F  5.596995 0.298431 -1.271684
F  3.516129 2.089781 -0.745764
F  5.084954 1.931269 0.72378
F  3.16214 1.060226 1.116952
O  2.403349 -1.035237 -0.548553
O  -7.128641 -0.689692 -0.233335
N  -3.080458 -0.209638 -0.042747
N  -4.329381 -0.669612 -0.035859
N  -4.302603 1.503134 -0.55438
N  -7.067878 1.502456 -0.808472
C  -1.994389 -1.082795 0.202856
C  0.20919 -1.867289 -0.38201
C  -0.885947 -1.051051 -0.6277
C  1.418579 -1.759251 -1.259342
C  -3.069256 1.110539 -0.343791
C  -2.048405 -1.95884 1.274694
C  0.147607 -2.733679 0.706885
C  3.523581 -0.757872 -1.333788
C  -1.883386 1.967378 -0.401527
C  -0.97268 -2.794422 1.520439
C  4.541071 -0.021923 -0.487037
C  -5.030845 0.389175 -0.349279
C  -1.74742 2.856824 -1.464706
C  -0.910391 1.927725 0.596037
C  4.060755 1.288501 0.167727
C  -0.63587 3.681484 -1.541857
C  0.194009 2.760331 0.51728
C  0.338396 3.631301 -0.554638
C  -6.513265 0.340664 -0.455008
H  -0.861208 -0.387924 -1.482978
H  1.795344 -2.748394 -1.544952
H  1.150329 -1.236929 -2.18496
H  -2.915753 -1.990937 1.920198
H  4.008017 -1.671465 -1.706429
H  3.27184 -0.146152 -2.209249
H  -1.006641 -3.480406 2.355699
H  -2.504878 2.894213 -2.237155
H  -1.016572 1.261779 1.442807
H  -0.530677 4.362516 -2.376207
H  0.938428 2.735372 1.301145
H  1.20516 4.276425 -0.616072
H  -6.508074 2.323004 -0.973907
H  -8.067938 1.578487 -0.906208
elementType: Cl F O N C H
totalener: -2061.57658526 hartree
nucrepener: 3342.74919546 hartree
electener: -5404.32578072 hartree
oneelecener: -9483.12220115 hartree
twoeener: 4078.79642043 hartree
cpcmener: -0.04597813 hartree
kineticenergy: 2054.89016520 hartree
xcener: -164.584939802881 hartree
chargesum: -0.0000000
charge: -0.072305 -0.185757 -0.186105 -0.166945 -0.160007 -0.159705 -0.339179 -0.489051 0.167432 -0.303460 -0.415185 -0.224796 0.048783 -0.014585 -0.113047 0.036145 0.471334 -0.160257 0.037723 -0.031274 -0.154809 -0.127397 0.339155 0.267162 -0.173925 -0.172093 0.467211 -0.190556 -0.194196 -0.099060 0.238109 0.155801 0.110073 0.100977 0.150642 0.120697 0.118188 0.143439 0.141686 0.156723 0.156839 0.154490 0.158950 0.197428 0.194706
qa: -0.0723 -0.1858 -0.1861 -0.1669 -0.1600 -0.1597 -0.3392 -0.4891 0.1674 -0.3035 -0.4152 -0.2248 0.0488 -0.0146 -0.1130 0.0361 0.4713 -0.1603 0.0377 -0.0313 -0.1548 -0.1274 0.3392 0.2672 -0.1739 -0.1721 0.4672 -0.1906 -0.1942 -0.0991 0.2381 0.1558 0.1101 0.1010 0.1506 0.1207 0.1182 0.1434 0.1417 0.1567 0.1568 0.1545 0.1590 0.1974 0.1947
va: 1.2533 1.1256 1.1204 1.1486 1.1561 1.1576 1.9566 2.0351 3.3849 2.9716 3.0460 3.2151 3.7337 3.7375 3.9080 3.9098 3.6240 4.0308 3.9290 3.9313 3.5115 4.0099 4.2532 3.7353 3.9704 3.8906 4.4143 3.9657 3.9052 3.8550 4.4082 0.9910 0.9959 0.9976 1.0138 1.0030 1.0052 1.0055 1.0203 1.0008 0.9942 1.0076 0.9931 1.0155 1.0029
dispcorr: -0.024151310 hartree
energy: -2061.600736574529
dipole: -33.11978 34.50548 1.38570 7.57113 -6.06232 1.50881 -9.64035 8.02553 -1.61482
magnitude: 2.60851 au
magnitude: 6.63030 debye
