program: Orca
programVersion: 5.0.2
elementType: Cl F F F F F O O N N N N C C C C C C C C C C C C C C C C C C C H H H H H H H H H H H H H H
charge: 0
multiplicity: 1
keywords: wb97x-d3
keywords: def2-TZVPP
keywords: def2/J RIJCOSX
keywords: DEFGRID2
keywords: scfconv7
keywords: smallprint printgap noloewdin
keywords: NOSOSCF
formula: C19H14ClF5N4O2
InChI: InChI=1/C19H14ClF5N4O2/c20-14-7-6-13(8-12(14)9-31-10-18(21,22)19(23,24)25)29-17(11-4-2-1-3-5-11)27-16(28-29)15(26)30/h1-8H,9-10,26H2
45 atoms
Cl 1.137316 -4.625037 1.106951
F  5.452524 0.715461 -0.50105
F  4.301761 -0.674052 -1.717079
F  4.062416 2.008654 -2.332748
F  3.178307 2.362193 -0.399914
F  2.22233 1.031507 -1.805311
O  2.281592 -0.631955 0.492962
O  -6.429518 -0.107916 -1.576658
N  -2.689306 -0.271496 0.025726
N  -3.871009 -0.52661 -0.530529
N  -3.667677 1.656408 -0.102923
N  -6.218719 2.105406 -1.132158
C  -1.76629 -1.321818 0.243193
C  0.503271 -2.140281 0.191341
C  -0.433593 -1.146962 -0.079725
C  1.942758 -1.859921 -0.130888
C  -2.573884 1.051285 0.294901
C  -2.213216 -2.51575 0.789376
C  0.04332 -3.329761 0.746436
C  3.642176 -0.32733 0.548234
C  -1.425749 1.699514 0.932382
C  -1.302623 -3.52661 1.027293
C  4.199044 0.262407 -0.741377
C  -4.425446 0.65635 -0.592011
C  -0.806321 1.146848 2.052197
C  -0.952405 2.898698 0.404304
C  3.396017 1.43716 -1.331958
C  0.291348 1.77553 2.617186
C  0.146111 3.52337 0.973975
C  0.774515 2.959281 2.075582
C  -5.791315 0.841265 -1.15013
H  -0.107384 -0.228703 -0.550146
H  2.598049 -2.659848 0.224054
H  2.055351 -1.808496 -1.218346
H  -3.256798 -2.660063 1.034285
H  3.774318 0.406465 1.346034
H  4.256709 -1.200978 0.80359
H  -1.640919 -4.461909 1.451503
H  -1.1836 0.234812 2.496284
H  -1.433132 3.33498 -0.461893
H  0.766983 1.340938 3.486531
H  0.513211 4.450095 0.552786
H  1.635168 3.445478 2.516375
H  -5.647684 2.850123 -0.766497
H  -7.133349 2.338235 -1.485735
elementType: Cl F O N C H
totalener: -2061.57415576 hartree
nucrepener: 3382.30438082 hartree
electener: -5443.87853658 hartree
oneelecener: -9562.14222696 hartree
twoeener: 4118.26369038 hartree
cpcmener: -0.04325871 hartree
kineticenergy: 2054.86347042 hartree
xcener: -164.582076673339 hartree
chargesum: -0.0000000
charge: -0.079347 -0.186276 -0.189293 -0.159057 -0.162725 -0.159366 -0.340641 -0.489239 0.166272 -0.304591 -0.415897 -0.224613 0.051585 0.022352 -0.168510 0.030911 0.468994 -0.175647 0.052804 -0.035146 -0.145594 -0.118241 0.340046 0.267269 -0.164171 -0.163423 0.462529 -0.197496 -0.207278 -0.097982 0.238328 0.160394 0.094756 0.123703 0.149477 0.129211 0.125275 0.141357 0.157295 0.141536 0.154523 0.154614 0.158888 0.197613 0.194802
qa: -0.0793 -0.1863 -0.1893 -0.1591 -0.1627 -0.1594 -0.3406 -0.4892 0.1663 -0.3046 -0.4159 -0.2246 0.0516 0.0224 -0.1685 0.0309 0.4690 -0.1756 0.0528 -0.0351 -0.1456 -0.1182 0.3400 0.2673 -0.1642 -0.1634 0.4625 -0.1975 -0.2073 -0.0980 0.2383 0.1604 0.0948 0.1237 0.1495 0.1292 0.1253 0.1414 0.1573 0.1415 0.1545 0.1546 0.1589 0.1976 0.1948
va: 1.2475 1.1233 1.1130 1.1567 1.1499 1.1509 1.9580 2.0347 3.3895 2.9672 3.0466 3.2159 3.7559 3.7190 3.9252 3.9045 3.6275 4.0407 3.8924 3.9109 3.4955 4.0093 4.1603 3.7378 3.8688 3.9596 4.4068 3.9086 3.9440 3.8275 4.4071 0.9991 1.0182 0.9905 1.0152 1.0047 1.0072 1.0062 0.9994 1.0199 0.9953 0.9955 0.9887 1.0149 1.0028
dispcorr: -0.025484542 hartree
energy: -2061.599640297421
dipole: -24.34590 26.52390 2.17800 6.22447 -5.13149 1.09298 13.82545 -12.01851 1.80694
magnitude: 3.03370 au
magnitude: 7.71105 debye
