program: Orca
programVersion: 5.0.2
elementType: Cl F F F F F O O N N N N C C C C C C C C C C C C C C C C C C C H H H H H H H H H H H H H H
charge: 0
multiplicity: 1
keywords: wb97x-d3
keywords: def2-TZVPP
keywords: def2/J RIJCOSX
keywords: DEFGRID2
keywords: scfconv7
keywords: smallprint printgap noloewdin
keywords: NOSOSCF
formula: C19H14ClF5N4O2
InChI: InChI=1/C19H14ClF5N4O2/c20-14-7-6-13(8-12(14)9-31-10-18(21,22)19(23,24)25)29-17(11-4-2-1-3-5-11)27-16(28-29)15(26)30/h1-8H,9-10,26H2
45 atoms
Cl 1.074303 -4.981375 -0.721378
F  1.660302 1.579222 1.237776
F  3.087925 1.192277 2.839369
F  3.596456 1.617441 -0.590965
F  5.060719 0.911809 0.825034
F  4.125567 2.836111 1.097322
O  2.471012 -0.845376 0.021688
O  -6.157317 0.118011 1.635556
N  -2.505391 -0.339626 -0.11638
N  -3.668571 -0.495352 0.512419
N  -3.417513 1.626565 -0.130758
N  -5.903146 2.263974 0.945293
C  -1.635577 -1.448898 -0.251351
C  0.59654 -2.354826 -0.290693
C  -0.264574 -1.27763 -0.138807
C  2.094128 -2.168916 -0.256197
C  -2.361538 0.949479 -0.513484
C  -2.179273 -2.702239 -0.484713
C  0.036776 -3.607412 -0.52363
C  2.645797 -0.568463 1.38293
C  -1.224703 1.51986 -1.240547
C  -1.333066 -3.789364 -0.610862
C  2.808612 0.92915 1.542586
C  -4.183371 0.705398 0.483316
C  -0.681692 2.718194 -0.783193
C  -0.689436 0.905095 -2.370979
C  3.919033 1.583772 0.695981
C  0.402815 3.283768 -1.435227
C  0.393214 1.476391 -3.019862
C  0.945915 2.660687 -2.549571
C  -5.51343 0.994321 1.080873
H  0.140911 -0.299193 0.068752
H  2.551043 -2.867724 0.454531
H  2.503423 -2.411442 -1.240667
H  -3.248574 -2.837601 -0.568805
H  1.786331 -0.872138 1.995334
H  3.529567 -1.075078 1.788608
H  -1.744999 -4.772899 -0.791234
H  -1.096807 3.198944 0.09321
H  -1.119188 -0.012381 -2.752329
H  0.827893 4.208168 -1.066732
H  0.805579 0.995324 -3.897006
H  1.796054 3.099632 -3.055442
H  -5.32897 2.941264 0.469606
H  -6.793672 2.563641 1.309776
elementType: Cl F O N C H
totalener: -2061.57540034 hartree
nucrepener: 3406.12240389 hartree
electener: -5467.69780422 hartree
oneelecener: -9609.81077737 hartree
twoeener: 4142.11297314 hartree
cpcmener: -0.04314327 hartree
kineticenergy: 2054.87717692 hartree
xcener: -164.588500208403 hartree
chargesum: 0.0000000
charge: -0.079790 -0.179670 -0.183818 -0.153937 -0.161770 -0.162067 -0.361369 -0.489869 0.164458 -0.305060 -0.415530 -0.224386 0.072586 0.102268 -0.200292 -0.000788 0.494128 -0.183138 -0.020100 -0.048831 -0.154365 -0.112424 0.332748 0.267288 -0.190382 -0.173623 0.464009 -0.201170 -0.170588 -0.109191 0.239523 0.171501 0.118821 0.128305 0.147679 0.136362 0.143343 0.142396 0.139405 0.156248 0.154542 0.155713 0.158584 0.197535 0.194715
qa: -0.0798 -0.1797 -0.1838 -0.1539 -0.1618 -0.1621 -0.3614 -0.4899 0.1645 -0.3051 -0.4155 -0.2244 0.0726 0.1023 -0.2003 -0.0008 0.4941 -0.1831 -0.0201 -0.0488 -0.1544 -0.1124 0.3327 0.2673 -0.1904 -0.1736 0.4640 -0.2012 -0.1706 -0.1092 0.2395 0.1715 0.1188 0.1283 0.1477 0.1364 0.1433 0.1424 0.1394 0.1562 0.1545 0.1557 0.1586 0.1975 0.1947
va: 1.2518 1.1143 1.1243 1.1543 1.1576 1.1519 1.9614 2.0339 3.3984 2.9675 3.0420 3.2157 3.7998 3.5062 3.9471 3.9609 3.5848 4.0382 3.9814 3.8795 3.4861 4.0030 4.2055 3.7365 3.9448 3.8843 4.4243 3.9295 3.9225 3.8313 4.4073 0.9926 0.9892 0.9879 1.0205 0.9938 1.0080 1.0055 1.0209 1.0010 0.9955 0.9942 0.9890 1.0152 1.0029
dispcorr: -0.025509087 hartree
energy: -2061.600909425616
dipole: -23.11673 25.10411 1.98738 0.76029 -0.51096 0.24933 -10.78915 9.63021 -1.15894
magnitude: 2.31408 au
magnitude: 5.88193 debye
